BDBM113593 US8633196, 26::US9365529, 26
SMILES: CC(C)S(=O)(=O)N1CCN(CC1)[C@@H](CNS(=O)(=O)c1ccc(OCc2cc(C)nc3ccccc23)cc1)C(=O)NO
InChI Key: InChIKey=AHKGXKHDKHAJDE-SANMLTNESA-N
Data: 8 IC50
Activity Spreadsheet -- Enzyme Inhibition Constant Data from BindingDB
Found 8 hits for monomerid = 113593
Trg + Lig
Ki
nM
ΔG°
kcal/mole
IC50
nM
Kd
nM
EC50/IC50
nM
koff
s-1
kon
M-1s-1
pHTemp
°C
Disintegrin and metalloproteinase domain-containing protein 17
(Homo sapiens (Human))
BDBM113593
(US8633196, 26 | US9365529, 26)
Show SMILES CC(C)S(=O)(=O)N1CCN(CC1)[C@@H](CNS(=O)(=O)c1ccc(OCc2cc(C)nc3ccccc23)cc1)C(=O)NO
Show InChI InChI=1S/C27H35N5O7S2/c1-19(2)41(37,38)32-14-12-31(13-15-32)26(27(33)30-34)17-28-40(35,36)23-10-8-22(9-11-23)39-18-21-16-20(3)29-25-7-5-4-6-24(21)25/h4-11,16,19,26,28,34H,12-15,17-18H2,1-3H3,(H,30,33)/t26-/m0/s1
Reactome pathway
US Patent
n/an/a 33n/an/an/an/a7.437
Galderma Research & Development
US Patent
Assay Description
The TACE enzyme is an internal production (carried out according to the publication protein Eng Des Sel 2006, 19, 155-161) and is added so as to have...
US Patent US8633196 (2014)
BindingDB Entry DOI: 10.7270/Q2KK99FQ
Disintegrin and metalloproteinase domain-containing protein 17
(Homo sapiens (Human))
BDBM113593
(US8633196, 26 | US9365529, 26)
Show SMILES CC(C)S(=O)(=O)N1CCN(CC1)[C@@H](CNS(=O)(=O)c1ccc(OCc2cc(C)nc3ccccc23)cc1)C(=O)NO
Show InChI InChI=1S/C27H35N5O7S2/c1-19(2)41(37,38)32-14-12-31(13-15-32)26(27(33)30-34)17-28-40(35,36)23-10-8-22(9-11-23)39-18-21-16-20(3)29-25-7-5-4-6-24(21)25/h4-11,16,19,26,28,34H,12-15,17-18H2,1-3H3,(H,30,33)/t26-/m0/s1
Reactome pathway
US Patent
n/an/a 33n/an/an/an/a7.437
GALDERMA RESEARCH & DEVLOPMENT
US Patent
Assay Description
The TACE enzyme is an internal production (carried out according to the publication protein Eng Des Sel 2006, 19, 155-161) and is added so as to have...
US Patent US9365529 (2016)
BindingDB Entry DOI: 10.7270/Q29W0DC8
Interstitial collagenase
(Homo sapiens (Human))
BDBM113593
(US8633196, 26 | US9365529, 26)
Show SMILES CC(C)S(=O)(=O)N1CCN(CC1)[C@@H](CNS(=O)(=O)c1ccc(OCc2cc(C)nc3ccccc23)cc1)C(=O)NO
Show InChI InChI=1S/C27H35N5O7S2/c1-19(2)41(37,38)32-14-12-31(13-15-32)26(27(33)30-34)17-28-40(35,36)23-10-8-22(9-11-23)39-18-21-16-20(3)29-25-7-5-4-6-24(21)25/h4-11,16,19,26,28,34H,12-15,17-18H2,1-3H3,(H,30,33)/t26-/m0/s1
Reactome pathway
US Patent
n/an/a 969n/an/an/an/an/an/a
GALDERMA RESEARCH & DEVLOPMENT
US Patent
Assay Description
The molecules are dose-response tested on the following enzymes: MMP1, MMP3, MMP9, ADAM9 and ADAM10, according to the same protocol as that described...
US Patent US9365529 (2016)
BindingDB Entry DOI: 10.7270/Q29W0DC8
Disintegrin and metalloproteinase domain-containing protein 17
(Homo sapiens (Human))
BDBM113593
(US8633196, 26 | US9365529, 26)
Show SMILES CC(C)S(=O)(=O)N1CCN(CC1)[C@@H](CNS(=O)(=O)c1ccc(OCc2cc(C)nc3ccccc23)cc1)C(=O)NO
Show InChI InChI=1S/C27H35N5O7S2/c1-19(2)41(37,38)32-14-12-31(13-15-32)26(27(33)30-34)17-28-40(35,36)23-10-8-22(9-11-23)39-18-21-16-20(3)29-25-7-5-4-6-24(21)25/h4-11,16,19,26,28,34H,12-15,17-18H2,1-3H3,(H,30,33)/t26-/m0/s1
Reactome pathway
US Patent
n/an/a 16n/an/an/an/a7.437
GALDERMA RESEARCH & DEVLOPMENT
US Patent
Assay Description
The TACE enzyme is an internal production (carried out according to the publication protein Eng Des Sel 2006, 19, 155-161) and is added so as to have...
US Patent US9365529 (2016)
BindingDB Entry DOI: 10.7270/Q29W0DC8
Matrix metalloproteinase-9
(Homo sapiens (Human))
BDBM113593
(US8633196, 26 | US9365529, 26)
Show SMILES CC(C)S(=O)(=O)N1CCN(CC1)[C@@H](CNS(=O)(=O)c1ccc(OCc2cc(C)nc3ccccc23)cc1)C(=O)NO
Show InChI InChI=1S/C27H35N5O7S2/c1-19(2)41(37,38)32-14-12-31(13-15-32)26(27(33)30-34)17-28-40(35,36)23-10-8-22(9-11-23)39-18-21-16-20(3)29-25-7-5-4-6-24(21)25/h4-11,16,19,26,28,34H,12-15,17-18H2,1-3H3,(H,30,33)/t26-/m0/s1
Reactome pathway
US Patent
n/an/a>1.00E+4n/an/an/an/an/an/a
GALDERMA RESEARCH & DEVLOPMENT
US Patent
Assay Description
The molecules are dose-response tested on the following enzymes: MMP1, MMP3, MMP9, ADAM9 and ADAM10, according to the same protocol as that described...
US Patent US9365529 (2016)
BindingDB Entry DOI: 10.7270/Q29W0DC8
Disintegrin and metalloproteinase domain-containing protein 9
(Homo sapiens (Human))
BDBM113593
(US8633196, 26 | US9365529, 26)
Show SMILES CC(C)S(=O)(=O)N1CCN(CC1)[C@@H](CNS(=O)(=O)c1ccc(OCc2cc(C)nc3ccccc23)cc1)C(=O)NO
Show InChI InChI=1S/C27H35N5O7S2/c1-19(2)41(37,38)32-14-12-31(13-15-32)26(27(33)30-34)17-28-40(35,36)23-10-8-22(9-11-23)39-18-21-16-20(3)29-25-7-5-4-6-24(21)25/h4-11,16,19,26,28,34H,12-15,17-18H2,1-3H3,(H,30,33)/t26-/m0/s1
US Patent
n/an/a>1.00E+4n/an/an/an/an/an/a
GALDERMA RESEARCH & DEVLOPMENT
US Patent
Assay Description
The molecules are dose-response tested on the following enzymes: MMP1, MMP3, MMP9, ADAM9 and ADAM10, according to the same protocol as that described...
US Patent US9365529 (2016)
BindingDB Entry DOI: 10.7270/Q29W0DC8
Disintegrin and metalloproteinase domain-containing protein 10
(Homo sapiens (Human))
BDBM113593
(US8633196, 26 | US9365529, 26)
Show SMILES CC(C)S(=O)(=O)N1CCN(CC1)[C@@H](CNS(=O)(=O)c1ccc(OCc2cc(C)nc3ccccc23)cc1)C(=O)NO
Show InChI InChI=1S/C27H35N5O7S2/c1-19(2)41(37,38)32-14-12-31(13-15-32)26(27(33)30-34)17-28-40(35,36)23-10-8-22(9-11-23)39-18-21-16-20(3)29-25-7-5-4-6-24(21)25/h4-11,16,19,26,28,34H,12-15,17-18H2,1-3H3,(H,30,33)/t26-/m0/s1
US Patent
n/an/a>1.00E+4n/an/an/an/an/an/a
GALDERMA RESEARCH & DEVLOPMENT
US Patent
Assay Description
The molecules are dose-response tested on the following enzymes: MMP1, MMP3, MMP9, ADAM9 and ADAM10, according to the same protocol as that described...
US Patent US9365529 (2016)
BindingDB Entry DOI: 10.7270/Q29W0DC8
Stromelysin-1
(Homo sapiens (Human))
BDBM113593
(US8633196, 26 | US9365529, 26)
Show SMILES CC(C)S(=O)(=O)N1CCN(CC1)[C@@H](CNS(=O)(=O)c1ccc(OCc2cc(C)nc3ccccc23)cc1)C(=O)NO
Show InChI InChI=1S/C27H35N5O7S2/c1-19(2)41(37,38)32-14-12-31(13-15-32)26(27(33)30-34)17-28-40(35,36)23-10-8-22(9-11-23)39-18-21-16-20(3)29-25-7-5-4-6-24(21)25/h4-11,16,19,26,28,34H,12-15,17-18H2,1-3H3,(H,30,33)/t26-/m0/s1
Reactome pathway
US Patent
n/an/a 574n/an/an/an/an/an/a
GALDERMA RESEARCH & DEVLOPMENT
US Patent
Assay Description
The molecules are dose-response tested on the following enzymes: MMP1, MMP3, MMP9, ADAM9 and ADAM10, according to the same protocol as that described...
US Patent US9365529 (2016)
BindingDB Entry DOI: 10.7270/Q29W0DC8