BDBM113734 N’-[3-(4-Methoxyphenyl)propyl]acetohydrazide (9g)
SMILES: COc1ccc(CCCNNC(C)=O)cc1
InChI Key: InChIKey=DQQGPOHSKKWYAS-UHFFFAOYSA-N
Data: 1 Other
Activity Spreadsheet -- Enzyme Inhibition Constant Data from BindingDB
Found 1 hit for monomerid = 113734
Trg + Lig
Ki
nM
ΔG°
kcal/mole
IC50
nM
Kd
nM
EC50/IC50
nM
koff
s-1
kon
M-1s-1
pHTemp
°C
Lysine-specific histone demethylase 1A
(Homo sapiens (Human))
BDBM113734
(N’-[3-(4-Methoxyphenyl)propyl]acetohydrazide ...)
Show SMILES COc1ccc(CCCNNC(C)=O)cc1
Show InChI InChI=1S/C12H18N2O2/c1-10(15)14-13-9-3-4-11-5-7-12(16-2)8-6-11/h5-8,13H,3-4,9H2,1-2H3,(H,14,15)
Reactome pathway
n/an/an/an/an/an/an/a7.5n/a
Johns Hopkins University School of Medicine , Baltimore, Maryland 21205, United States
Assay Description
Reactions (100 µL) were initiated by the addition of 2 µL of GST-LSD1 (final concentration 96-154 nM). The reaction mixture contained 50 mM...
ACS Chem Biol 9: 1284-93 (2014)
Article DOI: 10.1021/cb500018s
BindingDB Entry DOI: 10.7270/Q2FN14VF