BDBM113792 2-(4-Chlorophenyl)-2-(pyridin-2-yl)acetonitrile (24)
SMILES: Clc1ccc(cc1)C(C#N)c1ccccn1
InChI Key: InChIKey=TVLXKCIMEBLREH-UHFFFAOYSA-N
Data: 1 IC50
Activity Spreadsheet -- Enzyme Inhibition Constant Data from BindingDB
Found 1 hit for monomerid = 113792
Trg + Lig
Ki
nM
ΔG°
kcal/mole
IC50
nM
Kd
nM
EC50/IC50
nM
koff
s-1
kon
M-1s-1
pHTemp
°C
Acyl-homoserine lactone acylase PvdQ [A190E,F674L]
(Pseudomonas aeruginosa)
BDBM113792
(2-(4-Chlorophenyl)-2-(pyridin-2-yl)acetonitrile (2...)
Show SMILES Clc1ccc(cc1)C(C#N)c1ccccn1
Show InChI InChI=1S/C13H9ClN2/c14-11-6-4-10(5-7-11)12(9-15)13-3-1-2-8-16-13/h1-8,12H
n/an/a 270n/an/an/an/an/an/a
The Broad Institute , Cambridge, Massachusetts 02142, United States
Assay Description
The assay was performed with nine compound concentrations that ranged from 3 nM to 19.5 µM with PvdQ concentration of 20 nM. The positive contro...
ACS Chem Biol 9: 1536-44 (2014)
Article DOI: 10.1021/cb5001586
BindingDB Entry DOI: 10.7270/Q2PC311M