BDBM11529 (1S,3S,5S)-2-[(2S)-2-amino-2-(1-ethenylcyclopentyl)acetyl]-2-azabicyclo[3.1.0]hexane-3-carbonitrile; 2,2,2-trifluoroacetic acid::(S)-2-(1-Ethenylcyclopent-1-yl)glycine-L-cis-4,5-methanoprolinenitrile::BMS-477118 analogue::Saxagliptin Analogue 8d
SMILES: N[C@H](C(=O)N1[C@H]2C[C@H]2C[C@H]1C#N)C1(CCCC1)C=C
InChI Key: InChIKey=XRSXFIGDFPLGOG-MROQNXINSA-N
Data: 1 KI
Activity Spreadsheet -- Enzyme Inhibition Constant Data from BindingDB
Found 1 hit for monomerid = 11529
Trg + Lig
Ki
nM
ΔG°
kcal/mole
IC50
nM
Kd
nM
EC50/IC50
nM
koff
s-1
kon
M-1s-1
pHTemp
°C
Dipeptidyl peptidase 4
(Homo sapiens (Human))
BDBM11529
((1S,3S,5S)-2-[(2S)-2-amino-2-(1-ethenylcyclopentyl...)
Show SMILES N[C@H](C(=O)N1[C@H]2C[C@H]2C[C@H]1C#N)C1(CCCC1)C=C |r|
Show InChI InChI=1S/C15H21N3O/c1-2-15(5-3-4-6-15)13(17)14(19)18-11(9-16)7-10-8-12(10)18/h2,10-13H,1,3-8,17H2/t10-,11+,12+,13-/m1/s1
Reactome pathway
3.90 -11.3n/an/an/an/an/a7.422
Bristol-Myers Squibb Pharmaceutical Research Institute
Assay Description
Inhibition of human DPP-IV activity was measured under steady-state conditions by following the absorbance increase at 405 nm upon the substrate clea...
J Med Chem 48: 5025-37 (2005)
Article DOI: 10.1021/jm050261p
BindingDB Entry DOI: 10.7270/Q2FN14DM