null
SMILES: CNCC(Nc1ncnc2c(cc(OC)cc12)C(N)=O)c1cccc(F)c1
InChI Key: InChIKey=XQZHZCUJORPEOS-UHFFFAOYSA-N
Activity Spreadsheet -- Enzyme Inhibition Constant Data from BindingDB
Found 2 hits for monomerid = 116509
Trg + Lig
Ki
nM
ΔG°
kcal/mole
IC50
nM
Kd
nM
EC50/IC50
nM
koff
s-1
kon
M-1s-1
pHTemp
°C
Aurora kinase A
(Homo sapiens (Human))
BDBM116509
(US8637532, 190)
Show SMILES CNCC(Nc1ncnc2c(cc(OC)cc12)C(N)=O)c1cccc(F)c1
Show InChI InChI=1S/C19H20FN5O2/c1-22-9-16(11-4-3-5-12(20)6-11)25-19-15-8-13(27-2)7-14(18(21)26)17(15)23-10-24-19/h3-8,10,16,22H,9H2,1-2H3,(H2,21,26)(H,23,24,25)
NCI pathway
Reactome pathway
US Patent
n/an/a 480n/an/an/an/an/an/a
Merck Patent GmbH
US Patent
Assay Description
The Aurora assays described here are performed on two Caliper Life Sciences systems: the LC3000 and the Desktop Profiler. These provide data on enzym...
US Patent US8637532 (2014)
BindingDB Entry DOI: 10.7270/Q21G0JZX
Ribosomal protein S6 kinase beta-1
(Homo sapiens (Human))
BDBM116509
(US8637532, 190)
Show SMILES CNCC(Nc1ncnc2c(cc(OC)cc12)C(N)=O)c1cccc(F)c1
Show InChI InChI=1S/C19H20FN5O2/c1-22-9-16(11-4-3-5-12(20)6-11)25-19-15-8-13(27-2)7-14(18(21)26)17(15)23-10-24-19/h3-8,10,16,22H,9H2,1-2H3,(H2,21,26)(H,23,24,25)
NCI pathway
Reactome pathway
US Patent
n/an/a 0.420n/an/an/an/a7.525
Merck Patent GmbH
US Patent
Assay Description
P70S6K inhibitor compounds are diluted and plated in 96 well plates. A reaction mixture including the following components is then added to the compo...
US Patent US8637532 (2014)
BindingDB Entry DOI: 10.7270/Q21G0JZX