BDBM11685 (3aS,8aS)-1,3a,8-trimethyl-5-{[(2-methylphenyl)carbamoyl]oxy}-1-oxido-1H,2H,3H,3aH,8H,8aH-pyrrolo[2,3-b]indol-1-ium hydrochloride::Ganstigmine (CHF-2819) Analogue 2
SMILES: [H][C@@]12N(C)c3ccc(OC(=O)Nc4ccccc4C)cc3[C@]1(C)CC[N+]2(C)[O-]
InChI Key: InChIKey=GHYFEILIYSGWHS-GGGSXUAESA-N
Data: 1 IC50
PDB links: 1 PDB ID contains this monomer as substructures. 1 PDB ID contains inhibitors having a similarity of 90% to this monomer.
Activity Spreadsheet -- Enzyme Inhibition Constant Data from BindingDB
Found 1 hit for monomerid = 11685
Trg + Lig
Ki
nM
ΔG°
kcal/mole
IC50
nM
Kd
nM
EC50/IC50
nM
koff
s-1
kon
M-1s-1
pHTemp
°C
Acetylcholinesterase
(Tetronarce californica (Pacific electric ray) (Tor...)
BDBM11685
((3aS,8aS)-1,3a,8-trimethyl-5-{[(2-methylphenyl)car...)
Show SMILES [H][C@@]12N(C)c3ccc(OC(=O)Nc4ccccc4C)cc3[C@]1(C)CC[N+]2(C)[O-] |r|
Show InChI InChI=1S/C21H25N3O3/c1-14-7-5-6-8-17(14)22-20(25)27-15-9-10-18-16(13-15)21(2)11-12-24(4,26)19(21)23(18)3/h5-10,13,19H,11-12H2,1-4H3,(H,22,25)/t19-,21-,24?/m0/s1
n/an/a 4.04E+3n/an/an/an/a8.022
Istituto di Cristallografia
Assay Description
The cholinesterase assays were performed using colorimetric method reported by Ellman. Enzyme activity was determined by measuring the absorbance at ...
J Med Chem 49: 5051-8 (2006)
Article DOI: 10.1021/jm060293s
BindingDB Entry DOI: 10.7270/Q2DN439P