null
SMILES: ONC(=O)c1ccc2CCC(Cc2c1)Nc1ncccn1
InChI Key: InChIKey=JPOSGBAFUMSWBQ-UHFFFAOYSA-N
Activity Spreadsheet -- Enzyme Inhibition Constant Data from BindingDB
Found 2 hits for monomerid = 120950
Trg + Lig
Ki
nM
ΔG°
kcal/mole
IC50
nM
Kd
nM
EC50/IC50
nM
koff
s-1
kon
M-1s-1
pHTemp
°C
Histone deacetylase 6
(Homo sapiens (Human))
BDBM120950
(US8716285, 7)
Show SMILES ONC(=O)c1ccc2CCC(Cc2c1)Nc1ncccn1
Show InChI InChI=1S/C15H16N4O2/c20-14(19-21)11-3-2-10-4-5-13(9-12(10)8-11)18-15-16-6-1-7-17-15/h1-3,6-8,13,21H,4-5,9H2,(H,19,20)(H,16,17,18)
NCI pathway
Reactome pathway
n/an/an/an/a 730n/an/an/an/a
Roche Pharmaceutical Research and Early Development
Curated by ChEMBL
Assay Description
Inhibition of HDAC6 in human A549 cells assessed as tubulin acetylation after 17 to 18 hrs by cytoblot assay
J Med Chem 57: 8026-34 (2014)
Article DOI: 10.1021/jm5008962
BindingDB Entry DOI: 10.7270/Q29C700V
Histone deacetylase 8
(Homo sapiens (Human))
BDBM120950
(US8716285, 7)
Show SMILES ONC(=O)c1ccc2CCC(Cc2c1)Nc1ncccn1
Show InChI InChI=1S/C15H16N4O2/c20-14(19-21)11-3-2-10-4-5-13(9-12(10)8-11)18-15-16-6-1-7-17-15/h1-3,6-8,13,21H,4-5,9H2,(H,19,20)(H,16,17,18)
NCI pathway
Reactome pathway
US Patent
n/an/a 730n/an/an/an/an/an/a
Hoffmann-La Roche Inc.
US Patent
Assay Description
Compounds were tested for their ability to inhibit histone deacetylase 8 using an in vitro deacetylation assay. In a detailed procedure, 8 μl o...
US Patent US8716285 (2014)
BindingDB Entry DOI: 10.7270/Q2K072XG