null
SMILES: Cc1nc2ccccn2c1-c1cnc(Cl)c(NS(=O)(=O)c2ccc(F)cc2)c1
InChI Key: InChIKey=JTVJMRXPPATEJN-UHFFFAOYSA-N
Activity Spreadsheet -- Enzyme Inhibition Constant Data from BindingDB
Found 1 hit for monomerid = 122446
Trg + Lig
Ki
nM
ΔG°
kcal/mole
IC50
nM
Kd
nM
EC50/IC50
nM
koff
s-1
kon
M-1s-1
pHTemp
°C
Phosphatidylinositol 4,5-bisphosphate 3-kinase catalytic subunit alpha isoform
(Homo sapiens (Human))
BDBM122446
(US8729074, 1)
Show SMILES Cc1nc2ccccn2c1-c1cnc(Cl)c(NS(=O)(=O)c2ccc(F)cc2)c1
Show InChI InChI=1S/C19H14ClFN4O2S/c1-12-18(25-9-3-2-4-17(25)23-12)13-10-16(19(20)22-11-13)24-28(26,27)15-7-5-14(21)6-8-15/h2-11,24H,1H3
NCI pathway
Reactome pathway
US Patent
126n/a 76n/an/an/an/an/an/a
Amgen Inc.
US Patent
Assay Description
The PI3K AlphaScreen assay (PerkinElmer, Waltham, Mass.) measures the activity of a panel of four phosphoinositide 3-kinases: PI3Kα, PI3Kβ,...
US Patent US8729074 (2014)
BindingDB Entry DOI: 10.7270/Q2RJ4H4G