BDBM12733 3-[6-(4-{2-[(dimethylamino)methyl]phenyl}phenyl)-7-oxo-3-(trifluoromethyl)-1H,4H,5H,6H,7H-pyrazolo[3,4-c]pyridin-1-yl]benzamide::dihydropyrazolopyridinone analogue 6d
SMILES: CN(C)Cc1ccccc1-c1ccc(cc1)N1CCc2c(nn(c2C1=O)-c1cccc(c1)C(N)=O)C(F)(F)F
InChI Key: InChIKey=PKGPGSWPKRHPKB-UHFFFAOYSA-N
Data: 2 KI
PDB links: 1 PDB ID matches this monomer.
Activity Spreadsheet -- Enzyme Inhibition Constant Data from BindingDB
Found 2 hits for monomerid = 12733
Trg + Lig
Ki
nM
ΔG°
kcal/mole
IC50
nM
Kd
nM
EC50/IC50
nM
koff
s-1
kon
M-1s-1
pHTemp
°C
Coagulation factor X
(Homo sapiens (Human))
BDBM12733
(3-[6-(4-{2-[(dimethylamino)methyl]phenyl}phenyl)-7...)
Show SMILES CN(C)Cc1ccccc1-c1ccc(cc1)N1CCc2c(nn(c2C1=O)-c1cccc(c1)C(N)=O)C(F)(F)F
Show InChI InChI=1S/C29H26F3N5O2/c1-35(2)17-20-6-3-4-9-23(20)18-10-12-21(13-11-18)36-15-14-24-25(28(36)39)37(34-26(24)29(30,31)32)22-8-5-7-19(16-22)27(33)38/h3-13,16H,14-15,17H2,1-2H3,(H2,33,38)
Reactome pathway
0.180n/an/an/an/an/an/an/an/a
Bristol-Myers Squibb Company
Curated by ChEMBL
Assay Description
Inhibition of factor 10a
J Med Chem 53: 6243-74 (2010)
Article DOI: 10.1021/jm100146h
BindingDB Entry DOI: 10.7270/Q2CR5VBB
3D
3D Structure (crystal)
Coagulation factor X
(Homo sapiens (Human))
BDBM12733
(3-[6-(4-{2-[(dimethylamino)methyl]phenyl}phenyl)-7...)
Show SMILES CN(C)Cc1ccccc1-c1ccc(cc1)N1CCc2c(nn(c2C1=O)-c1cccc(c1)C(N)=O)C(F)(F)F
Show InChI InChI=1S/C29H26F3N5O2/c1-35(2)17-20-6-3-4-9-23(20)18-10-12-21(13-11-18)36-15-14-24-25(28(36)39)37(34-26(24)29(30,31)32)22-8-5-7-19(16-22)27(33)38/h3-13,16H,14-15,17H2,1-2H3,(H2,33,38)
Reactome pathway
0.180 -13.2n/an/an/an/an/a7.022
Bristol-Myers Squibb Pharmaceutical Research Institute
Assay Description
Ki values were obtained from human purified enzyme. All assays were run in microtiter plates. Plates were read for 30 min at 405 nm. Rates were deter...
Bioorg Med Chem Lett 16: 5584-9 (2006)
Article DOI: 10.1016/j.bmcl.2006.08.027
BindingDB Entry DOI: 10.7270/Q2Z899NQ
3D
3D Structure (crystal)