null
SMILES: Cc1cc(ccc1Cl)C(Nc1ccc(c(CN2CC(C2)C(O)=O)c1)C(F)(F)F)C(F)(F)F
InChI Key: InChIKey=MTDZRNKKWAYXFM-UHFFFAOYSA-N
Activity Spreadsheet -- Enzyme Inhibition Constant Data from BindingDB
Found 1 hit for monomerid = 127571
Trg + Lig
Ki
nM
ΔG°
kcal/mole
IC50
nM
Kd
nM
EC50/IC50
nM
koff
s-1
kon
M-1s-1
pHTemp
°C
Sphingosine 1-phosphate receptor 1
(Homo sapiens (Human))
BDBM127571
(US8791100, 69)
Show SMILES Cc1cc(ccc1Cl)C(Nc1ccc(c(CN2CC(C2)C(O)=O)c1)C(F)(F)F)C(F)(F)F
Show InChI InChI=1S/C21H19ClF6N2O2/c1-11-6-12(2-5-17(11)22)18(21(26,27)28)29-15-3-4-16(20(23,24)25)13(7-15)8-30-9-14(10-30)19(31)32/h2-7,14,18,29H,8-10H2,1H3,(H,31,32)
Reactome pathway
US Patent
n/an/a 0.800n/an/an/an/an/a37
Novartis AG
US Patent
Assay Description
The assay measures intracellular changes of Ca2+ mediated by the synthetic probing agonist 3-{[2-(2-Trifluoromethyl-biphenyl-4-yl)-benzo[b]thiophen-5...
US Patent US8791100 (2014)
BindingDB Entry DOI: 10.7270/Q2ZK5FCC