BDBM128371 US8802861, 14
SMILES: CC(=O)Nc1nc(C)c(s1)-c1csc(N)n1
InChI Key: InChIKey=HJVCYSMRXGHUDT-UHFFFAOYSA-N
Data: 1 IC50
Activity Spreadsheet -- Enzyme Inhibition Constant Data from BindingDB
Found 1 hit for monomerid = 128371
Trg + Lig
Ki
nM
ΔG°
kcal/mole
IC50
nM
Kd
nM
EC50/IC50
nM
koff
s-1
kon
M-1s-1
pHTemp
°C
Phosphatidylinositol 4,5-bisphosphate 3-kinase catalytic subunit gamma isoform
(Homo sapiens (Human))
BDBM128371
(US8802861, 14)
Show SMILES CC(=O)Nc1nc(C)c(s1)-c1csc(N)n1
Show InChI InChI=1S/C9H10N4OS2/c1-4-7(6-3-15-8(10)13-6)16-9(11-4)12-5(2)14/h3H,1-2H3,(H2,10,13)(H,11,12,14)
NCI pathway
Reactome pathway
US Patent
n/an/a 575n/an/an/an/an/an/a
Merck Serono SA
US Patent
Assay Description
The efficacy of compounds of the invention in inhibiting the PI3K induced-lipid phosphorylation may be tested in the following binding assay.The assa...
US Patent US8802861 (2014)
BindingDB Entry DOI: 10.7270/Q2HD7TCX