null
SMILES: COc1ccc(cc1-c1nc2C(=O)N(C(c2n1C(C)C)c1ccc(Cl)cc1)c1cc(Cl)ccc1C)C(N)=O
InChI Key: InChIKey=LNDPMEJTVLCCHE-UHFFFAOYSA-N
Activity Spreadsheet -- Enzyme Inhibition Constant Data from BindingDB
Found 1 hit for monomerid = 129894
Trg + Lig
Ki
nM
ΔG°
kcal/mole
IC50
nM
Kd
nM
EC50/IC50
nM
koff
s-1
kon
M-1s-1
pHTemp
°C
E3 ubiquitin-protein ligase Mdm2
(Homo sapiens (Human))
BDBM129894
(US8815926, 175)
Show SMILES COc1ccc(cc1-c1nc2C(=O)N(C(c2n1C(C)C)c1ccc(Cl)cc1)c1cc(Cl)ccc1C)C(N)=O
Show InChI InChI=1S/C29H26Cl2N4O3/c1-15(2)34-26-24(33-28(34)21-13-18(27(32)36)8-12-23(21)38-4)29(37)35(22-14-20(31)9-5-16(22)3)25(26)17-6-10-19(30)11-7-17/h5-15,25H,1-4H3,(H2,32,36)
NCI pathway
Reactome pathway
US Patent
n/an/a 0.100n/an/an/an/an/an/a
Novartis AG
US Patent
Assay Description
The inhibition of p53-MDM2 and p53-MDM4 interactions is measured by time resolved fluorescence energy transfer (TR-FRET). Fluorescence energy transfe...
US Patent US8815926 (2014)
BindingDB Entry DOI: 10.7270/Q29P309G