BDBM13028 3-(fluoromethyl)-N-(3,3,3-trifluoropropyl)-1,2,3,4-tetrahydroisoquinoline-7-sulfonamide::7-sulfonamide-THIQ 18::CHEMBL177621
SMILES: FCC1Cc2ccc(cc2CN1)S(=O)(=O)NCCC(F)(F)F
InChI Key: InChIKey=BBUDQLKRZPRPFD-UHFFFAOYSA-N
Data: 6 KI
PDB links: 1 PDB ID matches this monomer.
Activity Spreadsheet -- Enzyme Inhibition Constant Data from BindingDB
Found 6 hits for monomerid = 13028
Trg + Lig
Ki
nM
ΔG°
kcal/mole
IC50
nM
Kd
nM
EC50/IC50
nM
koff
s-1
kon
M-1s-1
pHTemp
°C
Phenylethanolamine N-methyltransferase
(Homo sapiens (Human))
BDBM13028
(3-(fluoromethyl)-N-(3,3,3-trifluoropropyl)-1,2,3,4...)
Show SMILES FCC1Cc2ccc(cc2CN1)S(=O)(=O)NCCC(F)(F)F
Show InChI InChI=1S/C13H16F4N2O2S/c14-7-11-5-9-1-2-12(6-10(9)8-18-11)22(20,21)19-4-3-13(15,16)17/h1-2,6,11,18-19H,3-5,7-8H2
Reactome pathway
35n/an/an/an/an/an/an/an/a
University of Queensland
Curated by ChEMBL
Assay Description
Inhibition of wild type human PNMT
J Med Chem 50: 4845-53 (2007)
Article DOI: 10.1021/jm0703385
BindingDB Entry DOI: 10.7270/Q2ZC82KK
3D
3D Structure (crystal)
Phenylethanolamine N-methyltransferase
(Homo sapiens (Human))
BDBM13028
(3-(fluoromethyl)-N-(3,3,3-trifluoropropyl)-1,2,3,4...)
Show SMILES FCC1Cc2ccc(cc2CN1)S(=O)(=O)NCCC(F)(F)F
Show InChI InChI=1S/C13H16F4N2O2S/c14-7-11-5-9-1-2-12(6-10(9)8-18-11)22(20,21)19-4-3-13(15,16)17/h1-2,6,11,18-19H,3-5,7-8H2
Reactome pathway
220n/an/an/an/an/an/an/an/a
University of Kansas
Curated by ChEMBL
Assay Description
Inhibition of [3H]-methyl-AdoMet binding to human phenylethnolamine N-methyltransferase expressed in E. coli BL21
J Med Chem 47: 4483-93 (2004)
Article DOI: 10.1021/jm0400653
BindingDB Entry DOI: 10.7270/Q20G3JM8
3D
3D Structure (crystal)
Phenylethanolamine N-methyltransferase
(Homo sapiens (Human))
BDBM13028
(3-(fluoromethyl)-N-(3,3,3-trifluoropropyl)-1,2,3,4...)
Show SMILES FCC1Cc2ccc(cc2CN1)S(=O)(=O)NCCC(F)(F)F
Show InChI InChI=1S/C13H16F4N2O2S/c14-7-11-5-9-1-2-12(6-10(9)8-18-11)22(20,21)19-4-3-13(15,16)17/h1-2,6,11,18-19H,3-5,7-8H2
Reactome pathway
220 -9.44n/an/an/an/an/a8.037
University of Kansas
Assay Description
Enzyme activity is determined by measuring the amount of 3H incorporated into the substrate during the reaction. AdoMet/[methyl-3H]AdoMet serves as a...
J Med Chem 49: 5424-33 (2006)
Article DOI: 10.1021/jm060466d
BindingDB Entry DOI: 10.7270/Q2DB802Q
3D
3D Structure (crystal)
Phenylethanolamine N-methyltransferase
(Homo sapiens (Human))
BDBM13028
(3-(fluoromethyl)-N-(3,3,3-trifluoropropyl)-1,2,3,4...)
Show SMILES FCC1Cc2ccc(cc2CN1)S(=O)(=O)NCCC(F)(F)F
Show InChI InChI=1S/C13H16F4N2O2S/c14-7-11-5-9-1-2-12(6-10(9)8-18-11)22(20,21)19-4-3-13(15,16)17/h1-2,6,11,18-19H,3-5,7-8H2
Reactome pathway
220n/an/an/an/an/an/an/an/a
University of Kansas
Curated by ChEMBL
Assay Description
In vitro binding affinity against human phenylethanolamine N-Methyltransferase
J Med Chem 48: 134-40 (2005)
Article DOI: 10.1021/jm049368n
BindingDB Entry DOI: 10.7270/Q2513XQ7
3D
3D Structure (crystal)
Phenylethanolamine N-methyltransferase
(Homo sapiens (Human))
BDBM13028
(3-(fluoromethyl)-N-(3,3,3-trifluoropropyl)-1,2,3,4...)
Show SMILES FCC1Cc2ccc(cc2CN1)S(=O)(=O)NCCC(F)(F)F
Show InChI InChI=1S/C13H16F4N2O2S/c14-7-11-5-9-1-2-12(6-10(9)8-18-11)22(20,21)19-4-3-13(15,16)17/h1-2,6,11,18-19H,3-5,7-8H2
Reactome pathway
220n/an/an/an/an/an/an/an/a
University of Kansas
Curated by ChEMBL
Assay Description
In vitro binding affinity against recombinant human Phenylethanolamine N-methyltransferase expressed in E. coli using [methyl-3H]-AdoMet
J Med Chem 48: 1806-12 (2005)
Article DOI: 10.1021/jm049594x
BindingDB Entry DOI: 10.7270/Q2TX3DW4
3D
3D Structure (crystal)
Alpha-2A adrenergic receptor [16-465]
(Rattus norvegicus (rat))
BDBM13028
(3-(fluoromethyl)-N-(3,3,3-trifluoropropyl)-1,2,3,4...)
Show SMILES FCC1Cc2ccc(cc2CN1)S(=O)(=O)NCCC(F)(F)F
Show InChI InChI=1S/C13H16F4N2O2S/c14-7-11-5-9-1-2-12(6-10(9)8-18-11)22(20,21)19-4-3-13(15,16)17/h1-2,6,11,18-19H,3-5,7-8H2
Reactome pathway
6.60E+5n/an/an/an/an/an/an/an/a
University of Kansas
Curated by ChEMBL
Assay Description
In vitro binding affinity against rat Alpha-2 adrenergic receptor using [3H]-clonidine
J Med Chem 48: 1806-12 (2005)
Article DOI: 10.1021/jm049594x
BindingDB Entry DOI: 10.7270/Q2TX3DW4