null
SMILES: COc1ccc(C(=O)Cc2c(Cl)cncc2Cl)n2nc(nc12)C1(CC1)C(=O)NCc1cccnc1
InChI Key: InChIKey=JACNHUODHLHMPV-UHFFFAOYSA-N
Activity Spreadsheet -- Enzyme Inhibition Constant Data from BindingDB
Found 1 hit for monomerid = 130935
Trg + Lig
Ki
nM
ΔG°
kcal/mole
IC50
nM
Kd
nM
EC50/IC50
nM
koff
s-1
kon
M-1s-1
pHTemp
°C
cAMP-specific 3',5'-cyclic phosphodiesterase 4A
(Homo sapiens (Human))
BDBM130935
(US8829190, 113)
Show SMILES COc1ccc(C(=O)Cc2c(Cl)cncc2Cl)n2nc(nc12)C1(CC1)C(=O)NCc1cccnc1
Show InChI InChI=1S/C24H20Cl2N6O3/c1-35-20-5-4-18(19(33)9-15-16(25)12-28-13-17(15)26)32-21(20)30-22(31-32)24(6-7-24)23(34)29-11-14-3-2-8-27-10-14/h2-5,8,10,12-13H,6-7,9,11H2,1H3,(H,29,34)
US Patent
n/an/a 0.700n/an/an/an/an/an/a
Leo Pharma A/S
US Patent
Assay Description
Human recombinant PDE4 (Gene bank accession no NM006203) was incubated for 1 hour with the test compound at concentrations up to 10 μM, with cAM...
US Patent US8829190 (2014)
BindingDB Entry DOI: 10.7270/Q2Z89B3Z