BDBM139962 US8901087, 215
SMILES: O[C@@H]([C@H]1O[C@@H]2SC(NCCF)=N[C@@H]2[C@@H](O)[C@@H]1O)C(F)(F)F
InChI Key: InChIKey=HNUIWBUJJKTTAX-QDJMVLKXSA-N
Data: 1 KI
Activity Spreadsheet -- Enzyme Inhibition Constant Data from BindingDB
Found 1 hit for monomerid = 139962
Trg + Lig
Ki
nM
ΔG°
kcal/mole
IC50
nM
Kd
nM
EC50/IC50
nM
koff
s-1
kon
M-1s-1
pHTemp
°C
Protein O-GlcNAcase
(Homo sapiens (Human))
BDBM139962
(US8901087, 215)
Show SMILES O[C@@H]([C@H]1O[C@@H]2SC(NCCF)=N[C@@H]2[C@@H](O)[C@@H]1O)C(F)(F)F |c:10|
Show InChI InChI=1S/C10H14F4N2O4S/c11-1-2-15-9-16-3-4(17)5(18)6(20-8(3)21-9)7(19)10(12,13)14/h3-8,17-19H,1-2H2,(H,15,16)/t3-,4-,5+,6+,7+,8-/m1/s1
US Patent
1.80 -11.9n/an/an/an/an/a7.025
Merck Sharp & Dohme Corp.
US Patent
Assay Description
Enzymatic reactions are carried out in a reaction containing 50 mM NaH2PO4, 100 mM NaCl and 0.1% BSA (pH 7.0) using 2 mM 4-Methylumbelliferyl N-acety...
US Patent US8901087 (2014)
BindingDB Entry DOI: 10.7270/Q24B301W