BDBM139993 US8901140, 8::US9358227, 8
SMILES: COCCOc1cc2ncnc(Nc3ccc(F)c(Cl)c3)c2cc1NC(=O)\C=C\[C@H]1CCCN1C
InChI Key: InChIKey=JLZPLOMYCANQFI-DBWMJRBXSA-N
Data: 2 IC50
Activity Spreadsheet -- Enzyme Inhibition Constant Data from BindingDB
Found 2 hits for monomerid = 139993
Trg + Lig
Ki
nM
ΔG°
kcal/mole
IC50
nM
Kd
nM
EC50/IC50
nM
koff
s-1
kon
M-1s-1
pHTemp
°C
Epidermal growth factor receptor
(Homo sapiens (Human))
BDBM139993
(US8901140, 8 | US9358227, 8)
Show SMILES COCCOc1cc2ncnc(Nc3ccc(F)c(Cl)c3)c2cc1NC(=O)\C=C\[C@H]1CCCN1C |r|
Show InChI InChI=1S/C25H27ClFN5O3/c1-32-9-3-4-17(32)6-8-24(33)31-22-13-18-21(14-23(22)35-11-10-34-2)28-15-29-25(18)30-16-5-7-20(27)19(26)12-16/h5-8,12-15,17H,3-4,9-11H2,1-2H3,(H,31,33)(H,28,29,30)/b8-6+/t17-/m1/s1
US Patent
n/an/a 2n/an/an/an/an/an/a
Jiangsu Hengrui Medicine Co., Ltd.; Shanghai Hengrui Pharmaceutical Co., Ltd.
US Patent
Assay Description
The following assay may be used to determine the activity of the compounds of the invention for inhibiting EGFR kinase activity. The half maximal inh...
US Patent US9358227 (2016)
BindingDB Entry DOI: 10.7270/Q2RJ4HB5
Epidermal growth factor receptor
(Homo sapiens (Human))
BDBM139993
(US8901140, 8 | US9358227, 8)
Show SMILES COCCOc1cc2ncnc(Nc3ccc(F)c(Cl)c3)c2cc1NC(=O)\C=C\[C@H]1CCCN1C |r|
Show InChI InChI=1S/C25H27ClFN5O3/c1-32-9-3-4-17(32)6-8-24(33)31-22-13-18-21(14-23(22)35-11-10-34-2)28-15-29-25(18)30-16-5-7-20(27)19(26)12-16/h5-8,12-15,17H,3-4,9-11H2,1-2H3,(H,31,33)(H,28,29,30)/b8-6+/t17-/m1/s1
US Patent
n/an/a 2n/an/an/an/an/an/a
Jiangsu Hengrui Medicine Co., Ltd.; Shanghai Hengrui Pharmaceutical Co., Ltd.
US Patent
Assay Description
The following assay may be used to determine the activity of the compounds of the invention for inhibiting EGFR kinase activity. The half maximal inh...
US Patent US8901140 (2014)
BindingDB Entry DOI: 10.7270/Q2VX0F76