BDBM140370 US8912173, 95
SMILES: C[C@@H](Oc1cc(cc2ncccc12)-c1ccc(CS(C)(=O)=O)nc1)[C@H]1CNC(=O)C1
InChI Key: InChIKey=OCLIMLAHJMETCD-RHSMWYFYSA-N
Data: 1 IC50
Activity Spreadsheet -- Enzyme Inhibition Constant Data from BindingDB
Found 1 hit for monomerid = 140370
Trg + Lig
Ki
nM
ΔG°
kcal/mole
IC50
nM
Kd
nM
EC50/IC50
nM
koff
s-1
kon
M-1s-1
pHTemp
°C
Tyrosine-protein kinase SYK
(Homo sapiens (Human))
BDBM140370
(US8912173, 95)
Show SMILES C[C@@H](Oc1cc(cc2ncccc12)-c1ccc(CS(C)(=O)=O)nc1)[C@H]1CNC(=O)C1 |r|
Show InChI InChI=1S/C22H23N3O4S/c1-14(17-10-22(26)25-12-17)29-21-9-16(8-20-19(21)4-3-7-23-20)15-5-6-18(24-11-15)13-30(2,27)28/h3-9,11,14,17H,10,12-13H2,1-2H3,(H,25,26)/t14-,17-/m1/s1
NCI pathway
Reactome pathway
US Patent
n/an/a 1.10n/an/an/an/a7.5-80
Boehringer Ingelheim International GmbH
US Patent
Assay Description
Recombinant human Syk (amino acids 342-635) was expressed as a fusion protein with an N-terminal GST tag, affinity-purified and deep-frozen at a conc...
US Patent US8912173 (2014)
BindingDB Entry DOI: 10.7270/Q2TX3D3T