BDBM144559 US8969568, 112
SMILES: COc1cc(ccc1OC(C)C)-c1cc2ncccc2c(O[C@H](C)[C@H]2CNC(=O)C2)n1
InChI Key: InChIKey=FONCQJLQDYUAIH-NVXWUHKLSA-N
Data: 1 IC50
Activity Spreadsheet -- Enzyme Inhibition Constant Data from BindingDB
Found 1 hit for monomerid = 144559
Trg + Lig
Ki
nM
ΔG°
kcal/mole
IC50
nM
Kd
nM
EC50/IC50
nM
koff
s-1
kon
M-1s-1
pHTemp
°C
Tyrosine-protein kinase SYK
(Homo sapiens (Human))
BDBM144559
(US8969568, 112)
Show SMILES COc1cc(ccc1OC(C)C)-c1cc2ncccc2c(O[C@H](C)[C@H]2CNC(=O)C2)n1 |r|
Show InChI InChI=1S/C24H27N3O4/c1-14(2)30-21-8-7-16(10-22(21)29-4)19-12-20-18(6-5-9-25-20)24(27-19)31-15(3)17-11-23(28)26-13-17/h5-10,12,14-15,17H,11,13H2,1-4H3,(H,26,28)/t15-,17-/m1/s1
NCI pathway
Reactome pathway
US Patent
n/an/a 0.100n/an/an/an/an/an/a
Boehringer Ingelheim Pharma GmbH & Co. KG
US Patent
Assay Description
Recombinant human Syk (amino acids 342-635) was expressed as a fusion protein with an N-terminal GST tag, affinity-purified and deep-frozen at a conc...
US Patent US8969568 (2015)
BindingDB Entry DOI: 10.7270/Q2154FRD