BDBM144772 US8952128, 29A
SMILES: C[C@@H](O)[C@@H]1NC(=O)[C@H](CCCCN)NC(=O)[C@@H](Cc2c[nH]c3ccccc23)NC(=O)[C@H](Cc2ccccc2)NC(=O)[C@H](Cc2ccccc2)NC(=O)[C@H](CCCNC(N)=N)NC(=O)[C@@H](CCCCNC(=O)[C@H](Cc2ccc(F)cc2)NC1=O)NCCCN(C[C@@H]1C[C@H]2[C@@H](Cc3c[nH]c4cccc2c34)N(C)C1)C(C)=O
InChI Key:
Data: 2 KI
Activity Spreadsheet -- Enzyme Inhibition Constant Data from BindingDB
Found 2 hits for monomerid = 144772
Trg + Lig
Ki
nM
ΔG°
kcal/mole
IC50
nM
Kd
nM
EC50/IC50
nM
koff
s-1
kon
M-1s-1
pHTemp
°C
Somatostatin receptor type 2
(Homo sapiens (Human))
BDBM144772
(US8952128, 29A)
Show SMILES C[C@@H](O)[C@@H]1NC(=O)[C@H](CCCCN)NC(=O)[C@@H](Cc2c[nH]c3ccccc23)NC(=O)[C@H](Cc2ccccc2)NC(=O)[C@H](Cc2ccccc2)NC(=O)[C@H](CCCNC(N)=N)NC(=O)[C@@H](CCCCNC(=O)[C@H](Cc2ccc(F)cc2)NC1=O)NCCCN(C[C@@H]1C[C@H]2[C@@H](Cc3c[nH]c4cccc2c34)N(C)C1)C(C)=O |r|
US Patent
0.130 -13.5n/an/an/an/an/a7.625
Ipsen Pharma S.A.S.
US Patent
Assay Description
Membranes for in vitro receptor binding assays were obtained by the following procedures. CHO-K1 cells expressing one of the somatostatin receptors w...
US Patent US8952128 (2015)
BindingDB Entry DOI: 10.7270/Q2057DNG
D(2) dopamine receptor
(Homo sapiens (Human))
BDBM144772
(US8952128, 29A)
Show SMILES C[C@@H](O)[C@@H]1NC(=O)[C@H](CCCCN)NC(=O)[C@@H](Cc2c[nH]c3ccccc23)NC(=O)[C@H](Cc2ccccc2)NC(=O)[C@H](Cc2ccccc2)NC(=O)[C@H](CCCNC(N)=N)NC(=O)[C@@H](CCCCNC(=O)[C@H](Cc2ccc(F)cc2)NC1=O)NCCCN(C[C@@H]1C[C@H]2[C@@H](Cc3c[nH]c4cccc2c34)N(C)C1)C(C)=O |r|
Reactome pathway
US Patent
46.8n/an/an/an/an/an/a7.6n/a
Ipsen Pharma S.A.S.
US Patent
Assay Description
The affinity of a test compound for the human dopamine receptor subtype hDRD2 was determined by radioligand binding assays in CHO-K1 cells stably tra...
US Patent US8952128 (2015)
BindingDB Entry DOI: 10.7270/Q2057DNG