null
SMILES: NCc1cccc2c(ccnc12)-c1cnn2cc(cnc12)-c1ccc(cc1)N1CCNCC1
InChI Key: InChIKey=ISWRGOFCPBCOGR-UHFFFAOYSA-N
Activity Spreadsheet -- Enzyme Inhibition Constant Data from BindingDB
Found 8 hits for monomerid = 148354
Trg + Lig
Ki
nM
ΔG°
kcal/mole
IC50
nM
Kd
nM
EC50/IC50
nM
koff
s-1
kon
M-1s-1
pHTemp
°C
Serine/threonine-protein kinase receptor R3
(Homo sapiens (Human))
BDBM148354
(US10017516, Compound 25 | US9682983, 25)
Show SMILES NCc1cccc2c(ccnc12)-c1cnn2cc(cnc12)-c1ccc(cc1)N1CCNCC1
Show InChI InChI=1S/C26H25N7/c27-14-19-2-1-3-23-22(8-9-29-25(19)23)24-16-31-33-17-20(15-30-26(24)33)18-4-6-21(7-5-18)32-12-10-28-11-13-32/h1-9,15-17,28H,10-14,27H2
US Patent
n/an/a 981n/an/an/an/a7.5n/a
The Brigham and Women's Hospital, Inc.; Dept. of Health and Human Services, National Institutes of Health
US Patent
Assay Description
Specifically, compounds were assayed using LANCE® Ultra ULight¿ technology (Perkin Elmer) against human ALK1-6 enzymes (ALK1: Life Technologies, ALK2...
US Patent US9682983 (2017)
BindingDB Entry DOI: 10.7270/Q28S4N3R
Activin receptor type-1
(Homo sapiens (Human))
BDBM148354
(US10017516, Compound 25 | US9682983, 25)
Show SMILES NCc1cccc2c(ccnc12)-c1cnn2cc(cnc12)-c1ccc(cc1)N1CCNCC1
Show InChI InChI=1S/C26H25N7/c27-14-19-2-1-3-23-22(8-9-29-25(19)23)24-16-31-33-17-20(15-30-26(24)33)18-4-6-21(7-5-18)32-12-10-28-11-13-32/h1-9,15-17,28H,10-14,27H2
US Patent
n/an/a 482n/an/an/an/a7.5n/a
The Brigham and Women's Hospital, Inc.; Dept. of Health and Human Services, National Institutes of Health
US Patent
Assay Description
Specifically, compounds were assayed using LANCE® Ultra ULight¿ technology (Perkin Elmer) against human ALK1-6 enzymes (ALK1: Life Technologies, ALK2...
US Patent US9682983 (2017)
BindingDB Entry DOI: 10.7270/Q28S4N3R
Bone morphogenetic protein receptor type-1A
(Homo sapiens (Human))
BDBM148354
(US10017516, Compound 25 | US9682983, 25)
Show SMILES NCc1cccc2c(ccnc12)-c1cnn2cc(cnc12)-c1ccc(cc1)N1CCNCC1
Show InChI InChI=1S/C26H25N7/c27-14-19-2-1-3-23-22(8-9-29-25(19)23)24-16-31-33-17-20(15-30-26(24)33)18-4-6-21(7-5-18)32-12-10-28-11-13-32/h1-9,15-17,28H,10-14,27H2
US Patent
n/an/a 1.41E+3n/an/an/an/a7.5n/a
The Brigham and Women's Hospital, Inc.; Dept. of Health and Human Services, National Institutes of Health
US Patent
Assay Description
Specifically, compounds were assayed using LANCE® Ultra ULight¿ technology (Perkin Elmer) against human ALK1-6 enzymes (ALK1: Life Technologies, ALK2...
US Patent US9682983 (2017)
BindingDB Entry DOI: 10.7270/Q28S4N3R
Bone morphogenetic protein receptor type-1B
(Homo sapiens (Human))
BDBM148354
(US10017516, Compound 25 | US9682983, 25)
Show SMILES NCc1cccc2c(ccnc12)-c1cnn2cc(cnc12)-c1ccc(cc1)N1CCNCC1
Show InChI InChI=1S/C26H25N7/c27-14-19-2-1-3-23-22(8-9-29-25(19)23)24-16-31-33-17-20(15-30-26(24)33)18-4-6-21(7-5-18)32-12-10-28-11-13-32/h1-9,15-17,28H,10-14,27H2
US Patent
n/an/a 590n/an/an/an/an/an/a
The Brigham and Women's Hospital, Inc.
US Patent
Assay Description
Compounds were assessed in ALK1-6 enzymatic assays. Specifically, compounds were assayed using LANCE® Ultra ULight technology (Perkin Elmer) against ...
US Patent US10017516 (2018)
BindingDB Entry DOI: 10.7270/Q20P12CN
Serine/threonine-protein kinase receptor R3
(Homo sapiens (Human))
BDBM148354
(US10017516, Compound 25 | US9682983, 25)
Show SMILES NCc1cccc2c(ccnc12)-c1cnn2cc(cnc12)-c1ccc(cc1)N1CCNCC1
Show InChI InChI=1S/C26H25N7/c27-14-19-2-1-3-23-22(8-9-29-25(19)23)24-16-31-33-17-20(15-30-26(24)33)18-4-6-21(7-5-18)32-12-10-28-11-13-32/h1-9,15-17,28H,10-14,27H2
US Patent
n/an/a 981n/an/an/an/an/an/a
The Brigham and Women's Hospital, Inc.
US Patent
Assay Description
Compounds were assessed in ALK1-6 enzymatic assays. Specifically, compounds were assayed using LANCE® Ultra ULight technology (Perkin Elmer) against ...
US Patent US10017516 (2018)
BindingDB Entry DOI: 10.7270/Q20P12CN
Activin receptor type-1
(Homo sapiens (Human))
BDBM148354
(US10017516, Compound 25 | US9682983, 25)
Show SMILES NCc1cccc2c(ccnc12)-c1cnn2cc(cnc12)-c1ccc(cc1)N1CCNCC1
Show InChI InChI=1S/C26H25N7/c27-14-19-2-1-3-23-22(8-9-29-25(19)23)24-16-31-33-17-20(15-30-26(24)33)18-4-6-21(7-5-18)32-12-10-28-11-13-32/h1-9,15-17,28H,10-14,27H2
US Patent
n/an/a 482n/an/an/an/an/an/a
The Brigham and Women's Hospital, Inc.
US Patent
Assay Description
Compounds were assessed in ALK1-6 enzymatic assays. Specifically, compounds were assayed using LANCE® Ultra ULight technology (Perkin Elmer) against ...
US Patent US10017516 (2018)
BindingDB Entry DOI: 10.7270/Q20P12CN
Bone morphogenetic protein receptor type-1A
(Homo sapiens (Human))
BDBM148354
(US10017516, Compound 25 | US9682983, 25)
Show SMILES NCc1cccc2c(ccnc12)-c1cnn2cc(cnc12)-c1ccc(cc1)N1CCNCC1
Show InChI InChI=1S/C26H25N7/c27-14-19-2-1-3-23-22(8-9-29-25(19)23)24-16-31-33-17-20(15-30-26(24)33)18-4-6-21(7-5-18)32-12-10-28-11-13-32/h1-9,15-17,28H,10-14,27H2
US Patent
n/an/a 1.41E+3n/an/an/an/an/an/a
The Brigham and Women's Hospital, Inc.
US Patent
Assay Description
Compounds were assessed in ALK1-6 enzymatic assays. Specifically, compounds were assayed using LANCE® Ultra ULight technology (Perkin Elmer) against ...
US Patent US10017516 (2018)
BindingDB Entry DOI: 10.7270/Q20P12CN
Bone morphogenetic protein receptor type-1B
(Homo sapiens (Human))
BDBM148354
(US10017516, Compound 25 | US9682983, 25)
Show SMILES NCc1cccc2c(ccnc12)-c1cnn2cc(cnc12)-c1ccc(cc1)N1CCNCC1
Show InChI InChI=1S/C26H25N7/c27-14-19-2-1-3-23-22(8-9-29-25(19)23)24-16-31-33-17-20(15-30-26(24)33)18-4-6-21(7-5-18)32-12-10-28-11-13-32/h1-9,15-17,28H,10-14,27H2
US Patent
n/an/a 590n/an/an/an/a7.5n/a
The Brigham and Women's Hospital, Inc.; Dept. of Health and Human Services, National Institutes of Health
US Patent
Assay Description
Specifically, compounds were assayed using LANCE® Ultra ULight¿ technology (Perkin Elmer) against human ALK1-6 enzymes (ALK1: Life Technologies, ALK2...
US Patent US9682983 (2017)
BindingDB Entry DOI: 10.7270/Q28S4N3R