null
SMILES: COc1cccc(n1)-c1ccc2nc(sc2c1)C(C(=O)NCCS(N)(=O)=O)S(C)(=O)=O
InChI Key: InChIKey=QUFJAIDJSCJSFO-UHFFFAOYSA-N
Activity Spreadsheet -- Enzyme Inhibition Constant Data from BindingDB
Found 2 hits for monomerid = 151380
Trg + Lig
Ki
nM
ΔG°
kcal/mole
IC50
nM
Kd
nM
EC50/IC50
nM
koff
s-1
kon
M-1s-1
pHTemp
°C
Hepatic triacylglycerol lipase
(Homo sapiens (Human))
BDBM151380
(US8987314, B185)
Show SMILES COc1cccc(n1)-c1ccc2nc(sc2c1)C(C(=O)NCCS(N)(=O)=O)S(C)(=O)=O
Show InChI InChI=1S/C18H20N4O6S3/c1-28-15-5-3-4-12(21-15)11-6-7-13-14(10-11)29-18(22-13)16(30(2,24)25)17(23)20-8-9-31(19,26)27/h3-7,10,16H,8-9H2,1-2H3,(H,20,23)(H2,19,26,27)
US Patent
n/an/a<10n/an/an/an/a8.025
Bristol-Myers Squibb Company
US Patent
Assay Description
Endothelial lipase (EL) and hepatic lipase (HL) activities were measured using a fluorescent substrate, A10070, (Invitrogen, CA) doped into an artifi...
US Patent US8987314 (2015)
BindingDB Entry DOI: 10.7270/Q2W094N8
Endothelial lipase
(Homo sapiens (Human))
BDBM151380
(US8987314, B185)
Show SMILES COc1cccc(n1)-c1ccc2nc(sc2c1)C(C(=O)NCCS(N)(=O)=O)S(C)(=O)=O
Show InChI InChI=1S/C18H20N4O6S3/c1-28-15-5-3-4-12(21-15)11-6-7-13-14(10-11)29-18(22-13)16(30(2,24)25)17(23)20-8-9-31(19,26)27/h3-7,10,16H,8-9H2,1-2H3,(H,20,23)(H2,19,26,27)
US Patent
n/an/a<10n/an/an/an/a8.025
Bristol-Myers Squibb Company
US Patent
Assay Description
Endothelial lipase (EL) and hepatic lipase (HL) activities were measured using a fluorescent substrate, A10070, (Invitrogen, CA) doped into an artifi...
US Patent US8987314 (2015)
BindingDB Entry DOI: 10.7270/Q2W094N8