BDBM152713 4-methyl-6-[2-(6-{methyl[2-(methylamino)ethyl]amino}pyridin-2-yl)ethyl]pyridin-2-amine (15)::US9951014, Name 14a
SMILES: CNCCN(C)c1cccc(CCc2cc(C)cc(N)n2)n1
InChI Key: InChIKey=AVQUEPVPLWZPMB-UHFFFAOYSA-N
Data: 8 KI  1 Kd
PDB links: 2 PDB IDs match this monomer.
Activity Spreadsheet -- Enzyme Inhibition Constant Data from BindingDB
Found 9 hits for monomerid = 152713
Trg + Lig
Ki
nM
ΔG°
kcal/mole
IC50
nM
Kd
nM
EC50/IC50
nM
koff
s-1
kon
M-1s-1
pHTemp
°C
Nitric-oxide synthase, brain
(Rattus norvegicus (rat))
BDBM152713
(4-methyl-6-[2-(6-{methyl[2-(methylamino)ethyl]amin...)
Show SMILES CNCCN(C)c1cccc(CCc2cc(C)cc(N)n2)n1
Show InChI InChI=1S/C17H25N5/c1-13-11-15(20-16(18)12-13)8-7-14-5-4-6-17(21-14)22(3)10-9-19-2/h4-6,11-12,19H,7-10H2,1-3H3,(H2,18,20)
35n/an/an/an/an/an/an/an/a
Northwestern University
Curated by ChEMBL
Assay Description
Inhibition of rat recombinant nNOS expressed in Escherichia coli by oxyhemoglobin NO assay
J Med Chem 58: 5548-60 (2015)
BindingDB Entry DOI: 10.7270/Q2319XN0
3D
3D Structure (crystal)
Nitric-oxide synthase, brain
(Rattus norvegicus (rat))
BDBM152713
(4-methyl-6-[2-(6-{methyl[2-(methylamino)ethyl]amin...)
Show SMILES CNCCN(C)c1cccc(CCc2cc(C)cc(N)n2)n1
Show InChI InChI=1S/C17H25N5/c1-13-11-15(20-16(18)12-13)8-7-14-5-4-6-17(21-14)22(3)10-9-19-2/h4-6,11-12,19H,7-10H2,1-3H3,(H2,18,20)
US Patent
35n/an/an/an/an/an/an/an/a
Astex
Assay Description
The NOSs isoform assays involved subjecting 3-8 to an oxyhemoglobin NO capture assay using a Biotek Gen5™ microplate reader. IC50 values for each com...
J Med Chem 52: 379-88 (2009)
BindingDB Entry DOI: 10.7270/Q21N83G1
3D
3D Structure (crystal)
Nitric oxide synthase, brain
(Homo sapiens (Human))
BDBM152713
(4-methyl-6-[2-(6-{methyl[2-(methylamino)ethyl]amin...)
Show SMILES CNCCN(C)c1cccc(CCc2cc(C)cc(N)n2)n1
Show InChI InChI=1S/C17H25N5/c1-13-11-15(20-16(18)12-13)8-7-14-5-4-6-17(21-14)22(3)10-9-19-2/h4-6,11-12,19H,7-10H2,1-3H3,(H2,18,20)
Reactome pathway
US Patent
64n/an/an/an/an/an/an/an/a
Astex
Assay Description
The NOSs isoform assays involved subjecting 3-8 to an oxyhemoglobin NO capture assay using a Biotek Gen5™ microplate reader. IC50 values for each com...
J Med Chem 52: 379-88 (2009)
BindingDB Entry DOI: 10.7270/Q21N83G1
3D
3D Structure (crystal)
Nitric oxide synthase, brain
(Homo sapiens (Human))
BDBM152713
(4-methyl-6-[2-(6-{methyl[2-(methylamino)ethyl]amin...)
Show SMILES CNCCN(C)c1cccc(CCc2cc(C)cc(N)n2)n1
Show InChI InChI=1S/C17H25N5/c1-13-11-15(20-16(18)12-13)8-7-14-5-4-6-17(21-14)22(3)10-9-19-2/h4-6,11-12,19H,7-10H2,1-3H3,(H2,18,20)
Reactome pathway
64n/an/an/an/an/an/an/an/a
Northwestern University
Curated by ChEMBL
Assay Description
Inhibition of human recombinant nNOS expressed in Escherichia coli by oxyhemoglobin NO assay
J Med Chem 58: 5548-60 (2015)
BindingDB Entry DOI: 10.7270/Q2319XN0
3D
3D Structure (crystal)
Nitric Oxide Synthase, inducible
(Mus musculus (mouse))
BDBM152713
(4-methyl-6-[2-(6-{methyl[2-(methylamino)ethyl]amin...)
Show SMILES CNCCN(C)c1cccc(CCc2cc(C)cc(N)n2)n1
Show InChI InChI=1S/C17H25N5/c1-13-11-15(20-16(18)12-13)8-7-14-5-4-6-17(21-14)22(3)10-9-19-2/h4-6,11-12,19H,7-10H2,1-3H3,(H2,18,20)
Reactome pathway
4.85E+3n/an/an/an/an/an/an/an/a
Northwestern University
Curated by ChEMBL
Assay Description
Inhibition of mouse recombinant iNOS expressed in Escherichia coli by oxyhemoglobin NO assay
J Med Chem 58: 5548-60 (2015)
BindingDB Entry DOI: 10.7270/Q2319XN0
Nitric oxide synthase, inducible
(Homo sapiens (Human))
BDBM152713
(4-methyl-6-[2-(6-{methyl[2-(methylamino)ethyl]amin...)
Show SMILES CNCCN(C)c1cccc(CCc2cc(C)cc(N)n2)n1
Show InChI InChI=1S/C17H25N5/c1-13-11-15(20-16(18)12-13)8-7-14-5-4-6-17(21-14)22(3)10-9-19-2/h4-6,11-12,19H,7-10H2,1-3H3,(H2,18,20)
NCI pathway
Reactome pathway
US Patent
4.85E+3n/an/an/an/an/an/an/an/a
Astex
Assay Description
The NOSs isoform assays involved subjecting 3-8 to an oxyhemoglobin NO capture assay using a Biotek Gen5™ microplate reader. IC50 values for each com...
J Med Chem 52: 379-88 (2009)
BindingDB Entry DOI: 10.7270/Q21N83G1
Nitric Oxide Synthase, endothelial
(Bos taurus (bovine))
BDBM152713
(4-methyl-6-[2-(6-{methyl[2-(methylamino)ethyl]amin...)
Show SMILES CNCCN(C)c1cccc(CCc2cc(C)cc(N)n2)n1
Show InChI InChI=1S/C17H25N5/c1-13-11-15(20-16(18)12-13)8-7-14-5-4-6-17(21-14)22(3)10-9-19-2/h4-6,11-12,19H,7-10H2,1-3H3,(H2,18,20)
1.77E+4n/an/an/an/an/an/an/an/a
Northwestern University
Curated by ChEMBL
Assay Description
Inhibition of bovine recombinant eNOS expressed in Escherichia coli by oxyhemoglobin NO assay
J Med Chem 58: 5548-60 (2015)
BindingDB Entry DOI: 10.7270/Q2319XN0
Nitric oxide synthase, endothelial
(Homo sapiens (Human))
BDBM152713
(4-methyl-6-[2-(6-{methyl[2-(methylamino)ethyl]amin...)
Show SMILES CNCCN(C)c1cccc(CCc2cc(C)cc(N)n2)n1
Show InChI InChI=1S/C17H25N5/c1-13-11-15(20-16(18)12-13)8-7-14-5-4-6-17(21-14)22(3)10-9-19-2/h4-6,11-12,19H,7-10H2,1-3H3,(H2,18,20)
US Patent
1.77E+4n/an/an/an/an/an/an/an/a
Astex
Assay Description
The NOSs isoform assays involved subjecting 3-8 to an oxyhemoglobin NO capture assay using a Biotek Gen5™ microplate reader. IC50 values for each com...
J Med Chem 52: 379-88 (2009)
BindingDB Entry DOI: 10.7270/Q21N83G1
Nitric oxide synthase (bsNOS)
(Bacillus subtilis (Firmicutes))
BDBM152713
(4-methyl-6-[2-(6-{methyl[2-(methylamino)ethyl]amin...)
Show SMILES CNCCN(C)c1cccc(CCc2cc(C)cc(N)n2)n1
Show InChI InChI=1S/C17H25N5/c1-13-11-15(20-16(18)12-13)8-7-14-5-4-6-17(21-14)22(3)10-9-19-2/h4-6,11-12,19H,7-10H2,1-3H3,(H2,18,20)
n/an/an/a 1.83E+4n/an/an/an/an/a
University of California, Irvine
Assay Description
In short, the difference between the imidazole-bound low-spin peak at 430 nm and the inhibitorbound high-spin peak at 395 nm was measured as a functi...
Biochemistry 54: 4075-82 (2015)
Article DOI: 10.1021/acs.biochem.5b00431
BindingDB Entry DOI: 10.7270/Q2Q23Z0J
3D
3D Structure (crystal)