null
SMILES: CCN(CCc1ccc(NC(=N)c2cccs2)cc1)Cc1cccc(NC(=N)c2cccs2)c1
InChI Key: InChIKey=ZAOJVZLLICOZMJ-UHFFFAOYSA-N
PDB links: 3 PDB IDs match this monomer.
Activity Spreadsheet -- Enzyme Inhibition Constant Data from BindingDB
Found 1 hit for monomerid = 152718
Trg + Lig
Ki
nM
ΔG°
kcal/mole
IC50
nM
Kd
nM
EC50/IC50
nM
koff
s-1
kon
M-1s-1
pHTemp
°C
Nitric oxide synthase oxygenase
(Bacillus subtilis (Firmicutes))
BDBM152718
(N-(3-{[ethyl({2-[4-(thiophene-2-imidamido)phenyl]e...)
Show SMILES CCN(CCc1ccc(NC(=N)c2cccs2)cc1)Cc1cccc(NC(=N)c2cccs2)c1
Show InChI InChI=1S/C27H29N5S2/c1-2-32(19-21-6-3-7-23(18-21)31-27(29)25-9-5-17-34-25)15-14-20-10-12-22(13-11-20)30-26(28)24-8-4-16-33-24/h3-13,16-18H,2,14-15,19H2,1H3,(H2,28,30)(H2,29,31)
n/an/an/a 6.23E+4n/an/an/an/an/a
University of California, Irvine
Assay Description
In short, the difference between the imidazole-bound low-spin peak at 430 nm and the inhibitorbound high-spin peak at 395 nm was measured as a functi...
Biochemistry 54: 4075-82 (2015)
Article DOI: 10.1021/acs.biochem.5b00431
BindingDB Entry DOI: 10.7270/Q2Q23Z0J
3D
3D Structure (crystal)