BDBM153198 US8993756, 5-10
SMILES: CCOC(=O)c1c[nH]c2ncnc(-c3ccc(F)c(NC(=O)C(F)=C)c3)c12
InChI Key: InChIKey=MUTOZSXSDDWABJ-UHFFFAOYSA-N
Data: 2 IC50
Activity Spreadsheet -- Enzyme Inhibition Constant Data from BindingDB
Found 2 hits for monomerid = 153198
Trg + Lig
Ki
nM
ΔG°
kcal/mole
IC50
nM
Kd
nM
EC50/IC50
nM
koff
s-1
kon
M-1s-1
pHTemp
°C
Tyrosine-protein kinase JAK2
(Homo sapiens (Human))
BDBM153198
(US8993756, 5-10)
Show SMILES CCOC(=O)c1c[nH]c2ncnc(-c3ccc(F)c(NC(=O)C(F)=C)c3)c12
Show InChI InChI=1S/C18H14F2N4O3/c1-3-27-18(26)11-7-21-16-14(11)15(22-8-23-16)10-4-5-12(20)13(6-10)24-17(25)9(2)19/h4-8H,2-3H2,1H3,(H,24,25)(H,21,22,23)
Reactome pathway
US Patent
n/an/a>1.50E+3n/an/an/an/an/a25
Merck Sharp & Dohme Corp.
US Patent
Assay Description
The ability of compounds to inhibit the activity of JAKl, JAK2, JAK3, and Tyk2 was measured using a recombinant purified GST-tagged catalytic domain ...
US Patent US8993756 (2015)
BindingDB Entry DOI: 10.7270/Q2VQ31DJ
Tyrosine-protein kinase JAK3
(Homo sapiens (Human))
BDBM153198
(US8993756, 5-10)
Show SMILES CCOC(=O)c1c[nH]c2ncnc(-c3ccc(F)c(NC(=O)C(F)=C)c3)c12
Show InChI InChI=1S/C18H14F2N4O3/c1-3-27-18(26)11-7-21-16-14(11)15(22-8-23-16)10-4-5-12(20)13(6-10)24-17(25)9(2)19/h4-8H,2-3H2,1H3,(H,24,25)(H,21,22,23)
Reactome pathway
US Patent
n/an/a 0.0130n/an/an/an/an/a25
Merck Sharp & Dohme Corp.
US Patent
Assay Description
The ability of compounds to inhibit the activity of JAKl, JAK2, JAK3, and Tyk2 was measured using a recombinant purified GST-tagged catalytic domain ...
US Patent US8993756 (2015)
BindingDB Entry DOI: 10.7270/Q2VQ31DJ