null
SMILES: COc1cccc(Nc2c(cnc3ccc(cc23)-c2ccc3cnn(C)c3c2)C(N)=O)c1
InChI Key: InChIKey=VNUWACGAODNREK-UHFFFAOYSA-N
Activity Spreadsheet -- Enzyme Inhibition Constant Data from BindingDB
Found 1 hit for monomerid = 153411
Trg + Lig
Ki
nM
ΔG°
kcal/mole
IC50
nM
Kd
nM
EC50/IC50
nM
koff
s-1
kon
M-1s-1
pHTemp
°C
Phosphodiesterase
(Trypanosoma brucei)
BDBM153411
(4-((3-Methoxyphenyl)amino)-6-(1-methyl-1H-indazol-...)
Show SMILES COc1cccc(Nc2c(cnc3ccc(cc23)-c2ccc3cnn(C)c3c2)C(N)=O)c1
Show InChI InChI=1S/C25H21N5O2/c1-30-23-11-16(6-7-17(23)13-28-30)15-8-9-22-20(10-15)24(21(14-27-22)25(26)31)29-18-4-3-5-19(12-18)32-2/h3-14H,1-2H3,(H2,26,31)(H,27,29)
n/an/a 1.20E+4n/an/an/an/a7.4n/a
Northeastern University
Assay Description
In short, recombinant TbrPDEB1 and TbrPDEB2 were assayed in 10 mM Tris pH 7.4, bovine serum albumin (0.2 mg/mL), 10 mM MgCl2, 25µM cAMP (Enzo Lifesci...
Chem Biol Drug Des 85: 549-64 (2015)
Article DOI: 10.1111/cbdd.12443
BindingDB Entry DOI: 10.7270/Q2FF3R28