null
SMILES: CCc1cc(cc2c(Nc3cccc(OC)c3)c(cnc12)C(N)=O)-c1ccc2cnn(C)c2c1
InChI Key: InChIKey=PHVOOTSFBKJAJG-UHFFFAOYSA-N
Activity Spreadsheet -- Enzyme Inhibition Constant Data from BindingDB
Found 1 hit for monomerid = 153412
Trg + Lig
Ki
nM
ΔG°
kcal/mole
IC50
nM
Kd
nM
EC50/IC50
nM
koff
s-1
kon
M-1s-1
pHTemp
°C
Phosphodiesterase
(Trypanosoma brucei)
BDBM153412
(8-Ethyl-4-((3-methoxyphenyl)amino)-6-(1-methyl-1H-...)
Show SMILES CCc1cc(cc2c(Nc3cccc(OC)c3)c(cnc12)C(N)=O)-c1ccc2cnn(C)c2c1
Show InChI InChI=1S/C27H25N5O2/c1-4-16-10-19(17-8-9-18-14-30-32(2)24(18)12-17)11-22-25(16)29-15-23(27(28)33)26(22)31-20-6-5-7-21(13-20)34-3/h5-15H,4H2,1-3H3,(H2,28,33)(H,29,31)
n/an/a 3.70E+3n/an/an/an/a7.4n/a
Northeastern University
Assay Description
In short, recombinant TbrPDEB1 and TbrPDEB2 were assayed in 10 mM Tris pH 7.4, bovine serum albumin (0.2 mg/mL), 10 mM MgCl2, 25µM cAMP (Enzo Lifesci...
Chem Biol Drug Des 85: 549-64 (2015)
Article DOI: 10.1111/cbdd.12443
BindingDB Entry DOI: 10.7270/Q2FF3R28