BDBM155923 US9018211, 2C
SMILES: Cc1c2COC(=O)c2ccc1[C@@H](O)CN1CCN(C[C@@H](O)c2ccc3C(=O)OCc3c2C)CC1
InChI Key: InChIKey=OCKGFTQIICXDQW-PSWAGMNNSA-N
Data: 11 IC50
Activity Spreadsheet -- Enzyme Inhibition Constant Data from BindingDB
Found 11 hits for monomerid = 155923
Trg + Lig
Ki
nM
ΔG°
kcal/mole
IC50
nM
Kd
nM
EC50/IC50
nM
koff
s-1
kon
M-1s-1
pHTemp
°C
ATP-sensitive inward rectifier potassium channel 1
(Rattus norvegicus (Rat))
BDBM155923
(US9018211, 2C)
Show SMILES Cc1c2COC(=O)c2ccc1[C@@H](O)CN1CCN(C[C@@H](O)c2ccc3C(=O)OCc3c2C)CC1 |r|
Show InChI InChI=1S/C26H30N2O6/c1-15-17(3-5-19-21(15)13-33-25(19)31)23(29)11-27-7-9-28(10-8-27)12-24(30)18-4-6-20-22(16(18)2)14-34-26(20)32/h3-6,23-24,29-30H,7-14H2,1-2H3/t23-,24+
US Patent
n/an/a 10n/an/an/an/a7.4n/a
Merck Sharp & Dohme Corp.
US Patent
Assay Description
Block of Kir 1.1 (ROMKl) currents was examined by whole cell voltage clamp (Hamill et. al. Pfluegers Archives 391 : 85- 100 (1981)) using the IonWork...
US Patent US9018211 (2015)
BindingDB Entry DOI: 10.7270/Q2CC0ZDS
1,3-beta-glucan synthase component GSC2
(Saccharomyces cerevisiae)
BDBM155923
(US9018211, 2C)
Show SMILES Cc1c2COC(=O)c2ccc1[C@@H](O)CN1CCN(C[C@@H](O)c2ccc3C(=O)OCc3c2C)CC1 |r|
Show InChI InChI=1S/C26H30N2O6/c1-15-17(3-5-19-21(15)13-33-25(19)31)23(29)11-27-7-9-28(10-8-27)12-24(30)18-4-6-20-22(16(18)2)14-34-26(20)32/h3-6,23-24,29-30H,7-14H2,1-2H3/t23-,24+
n/an/a>3.00E+4n/an/an/an/an/an/a
Merck Research Laboratories
Curated by ChEMBL
Assay Description
Inhibition of human ERG after 6 mins by electrophysiological assay
ACS Med Chem Lett 7: 697-701 (2016)
Article DOI: 10.1021/acsmedchemlett.6b00122
ATP-sensitive inward rectifier potassium channel 1
(Homo sapiens (Human))
BDBM155923
(US9018211, 2C)
Show SMILES Cc1c2COC(=O)c2ccc1[C@@H](O)CN1CCN(C[C@@H](O)c2ccc3C(=O)OCc3c2C)CC1 |r|
Show InChI InChI=1S/C26H30N2O6/c1-15-17(3-5-19-21(15)13-33-25(19)31)23(29)11-27-7-9-28(10-8-27)12-24(30)18-4-6-20-22(16(18)2)14-34-26(20)32/h3-6,23-24,29-30H,7-14H2,1-2H3/t23-,24+
Reactome pathway
n/an/a 9n/an/an/an/an/an/a
Merck Research Laboratories
Curated by ChEMBL
Assay Description
Inhibition of ROMK (unknown origin) expressed in CHO cells after 6 mins by electrophysiological assay
ACS Med Chem Lett 7: 697-701 (2016)
Article DOI: 10.1021/acsmedchemlett.6b00122
1,3-beta-glucan synthase component GSC2
(Saccharomyces cerevisiae)
BDBM155923
(US9018211, 2C)
Show SMILES Cc1c2COC(=O)c2ccc1[C@@H](O)CN1CCN(C[C@@H](O)c2ccc3C(=O)OCc3c2C)CC1 |r|
Show InChI InChI=1S/C26H30N2O6/c1-15-17(3-5-19-21(15)13-33-25(19)31)23(29)11-27-7-9-28(10-8-27)12-24(30)18-4-6-20-22(16(18)2)14-34-26(20)32/h3-6,23-24,29-30H,7-14H2,1-2H3/t23-,24+
n/an/a 1.00E+5n/an/an/an/an/an/a
Merck Research Laboratories
Curated by ChEMBL
Assay Description
Displacement of [35S]MK-499 from human ERG
ACS Med Chem Lett 7: 697-701 (2016)
Article DOI: 10.1021/acsmedchemlett.6b00122
ATP-sensitive inward rectifier potassium channel 1
(Homo sapiens (Human))
BDBM155923
(US9018211, 2C)
Show SMILES Cc1c2COC(=O)c2ccc1[C@@H](O)CN1CCN(C[C@@H](O)c2ccc3C(=O)OCc3c2C)CC1 |r|
Show InChI InChI=1S/C26H30N2O6/c1-15-17(3-5-19-21(15)13-33-25(19)31)23(29)11-27-7-9-28(10-8-27)12-24(30)18-4-6-20-22(16(18)2)14-34-26(20)32/h3-6,23-24,29-30H,7-14H2,1-2H3/t23-,24+
Reactome pathway
n/an/a 112n/an/an/an/an/an/a
Merck Research Laboratories
Curated by ChEMBL
Assay Description
Inhibition of ROMK (unknown origin) after 30 mins by 86Rb+ efflux assay
ACS Med Chem Lett 7: 697-701 (2016)
Article DOI: 10.1021/acsmedchemlett.6b00122
ATP-sensitive inward rectifier potassium channel 1
(Homo sapiens (Human))
BDBM155923
(US9018211, 2C)
Show SMILES Cc1c2COC(=O)c2ccc1[C@@H](O)CN1CCN(C[C@@H](O)c2ccc3C(=O)OCc3c2C)CC1 |r|
Show InChI InChI=1S/C26H30N2O6/c1-15-17(3-5-19-21(15)13-33-25(19)31)23(29)11-27-7-9-28(10-8-27)12-24(30)18-4-6-20-22(16(18)2)14-34-26(20)32/h3-6,23-24,29-30H,7-14H2,1-2H3/t23-,24+
Reactome pathway
n/an/a 10n/an/an/an/an/an/a
Merck Research Laboratories
Curated by ChEMBL
Assay Description
Inhibition of ROMK (unknown origin) after 30 mins by Tl+ influx assay
ACS Med Chem Lett 7: 697-701 (2016)
Article DOI: 10.1021/acsmedchemlett.6b00122
1,3-beta-glucan synthase component GSC2
(Saccharomyces cerevisiae)
BDBM155923
(US9018211, 2C)
Show SMILES Cc1c2COC(=O)c2ccc1[C@@H](O)CN1CCN(C[C@@H](O)c2ccc3C(=O)OCc3c2C)CC1 |r|
Show InChI InChI=1S/C26H30N2O6/c1-15-17(3-5-19-21(15)13-33-25(19)31)23(29)11-27-7-9-28(10-8-27)12-24(30)18-4-6-20-22(16(18)2)14-34-26(20)32/h3-6,23-24,29-30H,7-14H2,1-2H3/t23-,24+
n/an/a>3.00E+4n/an/an/an/an/an/a
Merck Research Laboratories
Curated by ChEMBL
Assay Description
Inhibition of human ERG after 6 mins by electrophysiological assay
ACS Med Chem Lett 7: 697-701 (2016)
Article DOI: 10.1021/acsmedchemlett.6b00122
ATP-sensitive inward rectifier potassium channel 1
(Homo sapiens (Human))
BDBM155923
(US9018211, 2C)
Show SMILES Cc1c2COC(=O)c2ccc1[C@@H](O)CN1CCN(C[C@@H](O)c2ccc3C(=O)OCc3c2C)CC1 |r|
Show InChI InChI=1S/C26H30N2O6/c1-15-17(3-5-19-21(15)13-33-25(19)31)23(29)11-27-7-9-28(10-8-27)12-24(30)18-4-6-20-22(16(18)2)14-34-26(20)32/h3-6,23-24,29-30H,7-14H2,1-2H3/t23-,24+
Reactome pathway
n/an/a 9n/an/an/an/an/an/a
Merck Research Laboratories
Curated by ChEMBL
Assay Description
Inhibition of ROMK (unknown origin) expressed in CHO cells after 6 mins by electrophysiological assay
ACS Med Chem Lett 7: 697-701 (2016)
Article DOI: 10.1021/acsmedchemlett.6b00122
1,3-beta-glucan synthase component GSC2
(Saccharomyces cerevisiae)
BDBM155923
(US9018211, 2C)
Show SMILES Cc1c2COC(=O)c2ccc1[C@@H](O)CN1CCN(C[C@@H](O)c2ccc3C(=O)OCc3c2C)CC1 |r|
Show InChI InChI=1S/C26H30N2O6/c1-15-17(3-5-19-21(15)13-33-25(19)31)23(29)11-27-7-9-28(10-8-27)12-24(30)18-4-6-20-22(16(18)2)14-34-26(20)32/h3-6,23-24,29-30H,7-14H2,1-2H3/t23-,24+
n/an/a 1.00E+5n/an/an/an/an/an/a
Merck Research Laboratories
Curated by ChEMBL
Assay Description
Displacement of [35S]MK-499 from human ERG
ACS Med Chem Lett 7: 697-701 (2016)
Article DOI: 10.1021/acsmedchemlett.6b00122
ATP-sensitive inward rectifier potassium channel 1
(Homo sapiens (Human))
BDBM155923
(US9018211, 2C)
Show SMILES Cc1c2COC(=O)c2ccc1[C@@H](O)CN1CCN(C[C@@H](O)c2ccc3C(=O)OCc3c2C)CC1 |r|
Show InChI InChI=1S/C26H30N2O6/c1-15-17(3-5-19-21(15)13-33-25(19)31)23(29)11-27-7-9-28(10-8-27)12-24(30)18-4-6-20-22(16(18)2)14-34-26(20)32/h3-6,23-24,29-30H,7-14H2,1-2H3/t23-,24+
Reactome pathway
n/an/a 112n/an/an/an/an/an/a
Merck Research Laboratories
Curated by ChEMBL
Assay Description
Inhibition of ROMK (unknown origin) after 30 mins by 86Rb+ efflux assay
ACS Med Chem Lett 7: 697-701 (2016)
Article DOI: 10.1021/acsmedchemlett.6b00122
ATP-sensitive inward rectifier potassium channel 1
(Homo sapiens (Human))
BDBM155923
(US9018211, 2C)
Show SMILES Cc1c2COC(=O)c2ccc1[C@@H](O)CN1CCN(C[C@@H](O)c2ccc3C(=O)OCc3c2C)CC1 |r|
Show InChI InChI=1S/C26H30N2O6/c1-15-17(3-5-19-21(15)13-33-25(19)31)23(29)11-27-7-9-28(10-8-27)12-24(30)18-4-6-20-22(16(18)2)14-34-26(20)32/h3-6,23-24,29-30H,7-14H2,1-2H3/t23-,24+
Reactome pathway
n/an/a 10n/an/an/an/an/an/a
Merck Research Laboratories
Curated by ChEMBL
Assay Description
Inhibition of ROMK (unknown origin) after 30 mins by Tl+ influx assay
ACS Med Chem Lett 7: 697-701 (2016)
Article DOI: 10.1021/acsmedchemlett.6b00122