null
SMILES: Cc1c2COC(=O)c2ccc1CCN1CCN(CC(O)c2ccc3C(=O)OCc3c2C)CC1
InChI Key: InChIKey=FRTFPWJYBDIGEF-UHFFFAOYSA-N
Activity Spreadsheet -- Enzyme Inhibition Constant Data from BindingDB
Found 5 hits for monomerid = 155925
Trg + Lig
Ki
nM
ΔG°
kcal/mole
IC50
nM
Kd
nM
EC50/IC50
nM
koff
s-1
kon
M-1s-1
pHTemp
°C
ATP-sensitive inward rectifier potassium channel 1
(Rattus norvegicus (Rat))
BDBM155925
(US9018211, 12)
Show SMILES Cc1c2COC(=O)c2ccc1CCN1CCN(CC(O)c2ccc3C(=O)OCc3c2C)CC1
Show InChI InChI=1S/C26H30N2O5/c1-16-18(3-4-20-22(16)14-32-25(20)30)7-8-27-9-11-28(12-10-27)13-24(29)19-5-6-21-23(17(19)2)15-33-26(21)31/h3-6,24,29H,7-15H2,1-2H3
US Patent
n/an/a 13n/an/an/an/a7.4n/a
Merck Sharp & Dohme Corp.
US Patent
Assay Description
Block of Kir 1.1 (ROMKl) currents was examined by whole cell voltage clamp (Hamill et. al. Pfluegers Archives 391 : 85- 100 (1981)) using the IonWork...
US Patent US9018211 (2015)
BindingDB Entry DOI: 10.7270/Q2CC0ZDS
1,3-beta-glucan synthase component GSC2
(Saccharomyces cerevisiae)
BDBM155925
(US9018211, 12)
Show SMILES Cc1c2COC(=O)c2ccc1CCN1CCN(CC(O)c2ccc3C(=O)OCc3c2C)CC1
Show InChI InChI=1S/C26H30N2O5/c1-16-18(3-4-20-22(16)14-32-25(20)30)7-8-27-9-11-28(12-10-27)13-24(29)19-5-6-21-23(17(19)2)15-33-26(21)31/h3-6,24,29H,7-15H2,1-2H3
n/an/a 5.20E+3n/an/an/an/an/an/a
Merck Research Laboratories
Curated by ChEMBL
Assay Description
Displacement of [35S]MK-499 from human ERG
ACS Med Chem Lett 7: 697-701 (2016)
Article DOI: 10.1021/acsmedchemlett.6b00122
ATP-sensitive inward rectifier potassium channel 1
(Homo sapiens (Human))
BDBM155925
(US9018211, 12)
Show SMILES Cc1c2COC(=O)c2ccc1CCN1CCN(CC(O)c2ccc3C(=O)OCc3c2C)CC1
Show InChI InChI=1S/C26H30N2O5/c1-16-18(3-4-20-22(16)14-32-25(20)30)7-8-27-9-11-28(12-10-27)13-24(29)19-5-6-21-23(17(19)2)15-33-26(21)31/h3-6,24,29H,7-15H2,1-2H3
Reactome pathway
n/an/a 34n/an/an/an/an/an/a
Merck Research Laboratories
Curated by ChEMBL
Assay Description
Inhibition of ROMK (unknown origin) after 30 mins by 86Rb+ efflux assay
ACS Med Chem Lett 7: 697-701 (2016)
Article DOI: 10.1021/acsmedchemlett.6b00122
ATP-sensitive inward rectifier potassium channel 1
(Homo sapiens (Human))
BDBM155925
(US9018211, 12)
Show SMILES Cc1c2COC(=O)c2ccc1CCN1CCN(CC(O)c2ccc3C(=O)OCc3c2C)CC1
Show InChI InChI=1S/C26H30N2O5/c1-16-18(3-4-20-22(16)14-32-25(20)30)7-8-27-9-11-28(12-10-27)13-24(29)19-5-6-21-23(17(19)2)15-33-26(21)31/h3-6,24,29H,7-15H2,1-2H3
Reactome pathway
n/an/a 34n/an/an/an/an/an/a
Merck Research Laboratories
Curated by ChEMBL
Assay Description
Inhibition of ROMK (unknown origin) after 30 mins by 86Rb+ efflux assay
ACS Med Chem Lett 7: 697-701 (2016)
Article DOI: 10.1021/acsmedchemlett.6b00122
1,3-beta-glucan synthase component GSC2
(Saccharomyces cerevisiae)
BDBM155925
(US9018211, 12)
Show SMILES Cc1c2COC(=O)c2ccc1CCN1CCN(CC(O)c2ccc3C(=O)OCc3c2C)CC1
Show InChI InChI=1S/C26H30N2O5/c1-16-18(3-4-20-22(16)14-32-25(20)30)7-8-27-9-11-28(12-10-27)13-24(29)19-5-6-21-23(17(19)2)15-33-26(21)31/h3-6,24,29H,7-15H2,1-2H3
n/an/a 5.20E+3n/an/an/an/an/an/a
Merck Research Laboratories
Curated by ChEMBL
Assay Description
Displacement of [35S]MK-499 from human ERG
ACS Med Chem Lett 7: 697-701 (2016)
Article DOI: 10.1021/acsmedchemlett.6b00122