BDBM158906 US9034866, 381
SMILES: CN1CC[C@@](O)(C#Cc2cc3-c4nc(C(N)=O)n(C)c4C4CC(C4)c3cc2F)C1=O
InChI Key: InChIKey=AKCFTKFEYMPOJW-ZFPHJIABSA-N
Data: 2 KI
Activity Spreadsheet -- Enzyme Inhibition Constant Data from BindingDB
Found 2 hits for monomerid = 158906
Trg + Lig
Ki
nM
ΔG°
kcal/mole
IC50
nM
Kd
nM
EC50/IC50
nM
koff
s-1
kon
M-1s-1
pHTemp
°C
Mitogen-activated protein kinase kinase kinase 14
(Homo sapiens (Human))
BDBM158906
(US9034866, 381)
Show SMILES CN1CC[C@@](O)(C#Cc2cc3-c4nc(C(N)=O)n(C)c4C4CC(C4)c3cc2F)C1=O |r,wU:4.5,wD:4.4,(3.62,4.26,;4.39,2.92,;5.93,2.92,;6.4,1.46,;5.16,.55,;6.49,-.22,;3.82,-.22,;2.49,-.99,;1.16,-1.76,;-.18,-.99,;-1.51,-1.76,;-2.71,-.8,;-2.58,.74,;-3.99,1.34,;-4.39,2.83,;-3.3,3.92,;-5.88,3.23,;-5,.18,;-6.49,.58,;-4.22,-1.14,;-4.88,-2.53,;-4.22,-3.91,;-2.71,-4.26,;-3.33,-2.82,;-1.51,-3.3,;-.18,-4.07,;1.16,-3.3,;2.49,-4.07,;3.91,1.46,;2.58,.69,)|
Show InChI InChI=1S/C22H21FN4O3/c1-26-6-5-22(30,21(26)29)4-3-11-9-15-14(10-16(11)23)12-7-13(8-12)18-17(15)25-20(19(24)28)27(18)2/h9-10,12-13,30H,5-8H2,1-2H3,(H2,24,28)/t12?,13?,22-/m0/s1
US Patent
0.5n/an/an/an/an/an/a7.2n/a
Genentech, Inc.
US Patent
Assay Description
The ability of the nuclear factor-kappa B (NF-kB)-inducing kinase (NIK) to catalyze the hydrolysis of adenosine-5'-triphosphate (ATP) was monitored u...
US Patent US9034866 (2015)
BindingDB Entry DOI: 10.7270/Q2GX49B0
Mitogen-activated protein kinase kinase kinase 14
(Homo sapiens (Human))
BDBM158906
(US9034866, 381)
Show SMILES CN1CC[C@@](O)(C#Cc2cc3-c4nc(C(N)=O)n(C)c4C4CC(C4)c3cc2F)C1=O |r,wU:4.5,wD:4.4,(3.62,4.26,;4.39,2.92,;5.93,2.92,;6.4,1.46,;5.16,.55,;6.49,-.22,;3.82,-.22,;2.49,-.99,;1.16,-1.76,;-.18,-.99,;-1.51,-1.76,;-2.71,-.8,;-2.58,.74,;-3.99,1.34,;-4.39,2.83,;-3.3,3.92,;-5.88,3.23,;-5,.18,;-6.49,.58,;-4.22,-1.14,;-4.88,-2.53,;-4.22,-3.91,;-2.71,-4.26,;-3.33,-2.82,;-1.51,-3.3,;-.18,-4.07,;1.16,-3.3,;2.49,-4.07,;3.91,1.46,;2.58,.69,)|
Show InChI InChI=1S/C22H21FN4O3/c1-26-6-5-22(30,21(26)29)4-3-11-9-15-14(10-16(11)23)12-7-13(8-12)18-17(15)25-20(19(24)28)27(18)2/h9-10,12-13,30H,5-8H2,1-2H3,(H2,24,28)/t12?,13?,22-/m0/s1
US Patent
370n/an/an/an/an/an/a7.2n/a
Genentech, Inc.
US Patent
Assay Description
The ability of the nuclear factor-kappa B (NF-kB)-inducing kinase (NIK) to catalyze the hydrolysis of adenosine-5'-triphosphate (ATP) was monitored u...
US Patent US9034866 (2015)
BindingDB Entry DOI: 10.7270/Q2GX49B0