BDBM159183 US9034866, 660
SMILES: Cc1cnc(o1)[C@](C)(O)C#Cc1ccc2C3CC(C3)n3cc(nc3-c2c1)C(N)=O
InChI Key: InChIKey=RODIOQSCTKCZKO-BYHBIXDJSA-N
Data: 4 KI
Activity Spreadsheet -- Enzyme Inhibition Constant Data from BindingDB
Found 4 hits for monomerid = 159183
Trg + Lig
Ki
nM
ΔG°
kcal/mole
IC50
nM
Kd
nM
EC50/IC50
nM
koff
s-1
kon
M-1s-1
pHTemp
°C
Protein kinase C, PKC; classical/novel
(Homo sapiens (Human))
BDBM159183
(US9034866, 660)
Show SMILES Cc1cnc(o1)[C@](C)(O)C#Cc1ccc2C3CC(C3)n3cc(nc3-c2c1)C(N)=O |r,wU:6.8,wD:6.7,(8.21,.73,;6.88,-.04,;6.4,-1.51,;4.86,-1.51,;4.38,-.04,;5.63,.86,;3.05,.73,;4.38,1.5,;3.05,2.27,;1.72,-.04,;.38,-.81,;-.95,-1.58,;-.95,-3.12,;-2.28,-3.89,;-3.62,-3.12,;-4.82,-4.08,;-6.32,-3.74,;-6.99,-2.35,;-5.21,-2.35,;-6.32,-.98,;-7.23,.26,;-6.32,1.51,;-4.86,1.03,;-4.86,-.51,;-3.62,-1.58,;-2.28,-.81,;-6.72,3,;-5.63,4.08,;-8.21,3.39,)|
Show InChI InChI=1S/C22H20N4O3/c1-12-10-24-21(29-12)22(2,28)6-5-13-3-4-16-14-8-15(9-14)26-11-18(19(23)27)25-20(26)17(16)7-13/h3-4,7,10-11,14-15,28H,8-9H2,1-2H3,(H2,23,27)/t14?,15?,22-/m1/s1
NCI pathway
Reactome pathway
<0.200n/an/an/an/an/an/an/an/a
Genentech
Curated by ChEMBL
Assay Description
Inhibition of full length GST-tagged human PRKD1 expressed in Baculovirus expression system using ATP as substrate incubated for 1 to 2 hrs by transc...
ACS Med Chem Lett 10: 1260-1265 (2019)
Article DOI: 10.1021/acsmedchemlett.8b00658
Mitogen-activated protein kinase kinase kinase 14
(Homo sapiens (Human))
BDBM159183
(US9034866, 660)
Show SMILES Cc1cnc(o1)[C@](C)(O)C#Cc1ccc2C3CC(C3)n3cc(nc3-c2c1)C(N)=O |r,wU:6.8,wD:6.7,(8.21,.73,;6.88,-.04,;6.4,-1.51,;4.86,-1.51,;4.38,-.04,;5.63,.86,;3.05,.73,;4.38,1.5,;3.05,2.27,;1.72,-.04,;.38,-.81,;-.95,-1.58,;-.95,-3.12,;-2.28,-3.89,;-3.62,-3.12,;-4.82,-4.08,;-6.32,-3.74,;-6.99,-2.35,;-5.21,-2.35,;-6.32,-.98,;-7.23,.26,;-6.32,1.51,;-4.86,1.03,;-4.86,-.51,;-3.62,-1.58,;-2.28,-.81,;-6.72,3,;-5.63,4.08,;-8.21,3.39,)|
Show InChI InChI=1S/C22H20N4O3/c1-12-10-24-21(29-12)22(2,28)6-5-13-3-4-16-14-8-15(9-14)26-11-18(19(23)27)25-20(26)17(16)7-13/h3-4,7,10-11,14-15,28H,8-9H2,1-2H3,(H2,23,27)/t14?,15?,22-/m1/s1
US Patent
0.290n/an/an/an/an/an/a7.2n/a
Genentech, Inc.
US Patent
Assay Description
The ability of the nuclear factor-kappa B (NF-kB)-inducing kinase (NIK) to catalyze the hydrolysis of adenosine-5'-triphosphate (ATP) was monitored u...
US Patent US9034866 (2015)
BindingDB Entry DOI: 10.7270/Q2GX49B0
Mitogen-activated protein kinase kinase kinase 14
(Homo sapiens (Human))
BDBM159183
(US9034866, 660)
Show SMILES Cc1cnc(o1)[C@](C)(O)C#Cc1ccc2C3CC(C3)n3cc(nc3-c2c1)C(N)=O |r,wU:6.8,wD:6.7,(8.21,.73,;6.88,-.04,;6.4,-1.51,;4.86,-1.51,;4.38,-.04,;5.63,.86,;3.05,.73,;4.38,1.5,;3.05,2.27,;1.72,-.04,;.38,-.81,;-.95,-1.58,;-.95,-3.12,;-2.28,-3.89,;-3.62,-3.12,;-4.82,-4.08,;-6.32,-3.74,;-6.99,-2.35,;-5.21,-2.35,;-6.32,-.98,;-7.23,.26,;-6.32,1.51,;-4.86,1.03,;-4.86,-.51,;-3.62,-1.58,;-2.28,-.81,;-6.72,3,;-5.63,4.08,;-8.21,3.39,)|
Show InChI InChI=1S/C22H20N4O3/c1-12-10-24-21(29-12)22(2,28)6-5-13-3-4-16-14-8-15(9-14)26-11-18(19(23)27)25-20(26)17(16)7-13/h3-4,7,10-11,14-15,28H,8-9H2,1-2H3,(H2,23,27)/t14?,15?,22-/m1/s1
0.900n/an/an/an/an/an/an/an/a
Genentech
Curated by ChEMBL
Assay Description
Inhibition of NIK (unknown origin) using ATP as substrate by transcreener ADP assay based fluorescence correlation spectroscopic analysis
ACS Med Chem Lett 10: 1260-1265 (2019)
Article DOI: 10.1021/acsmedchemlett.8b00658
Mitogen-activated protein kinase kinase kinase 14
(Homo sapiens (Human))
BDBM159183
(US9034866, 660)
Show SMILES Cc1cnc(o1)[C@](C)(O)C#Cc1ccc2C3CC(C3)n3cc(nc3-c2c1)C(N)=O |r,wU:6.8,wD:6.7,(8.21,.73,;6.88,-.04,;6.4,-1.51,;4.86,-1.51,;4.38,-.04,;5.63,.86,;3.05,.73,;4.38,1.5,;3.05,2.27,;1.72,-.04,;.38,-.81,;-.95,-1.58,;-.95,-3.12,;-2.28,-3.89,;-3.62,-3.12,;-4.82,-4.08,;-6.32,-3.74,;-6.99,-2.35,;-5.21,-2.35,;-6.32,-.98,;-7.23,.26,;-6.32,1.51,;-4.86,1.03,;-4.86,-.51,;-3.62,-1.58,;-2.28,-.81,;-6.72,3,;-5.63,4.08,;-8.21,3.39,)|
Show InChI InChI=1S/C22H20N4O3/c1-12-10-24-21(29-12)22(2,28)6-5-13-3-4-16-14-8-15(9-14)26-11-18(19(23)27)25-20(26)17(16)7-13/h3-4,7,10-11,14-15,28H,8-9H2,1-2H3,(H2,23,27)/t14?,15?,22-/m1/s1
US Patent
1.60E+3n/an/an/an/an/an/a7.2n/a
Genentech, Inc.
US Patent
Assay Description
The ability of the nuclear factor-kappa B (NF-kB)-inducing kinase (NIK) to catalyze the hydrolysis of adenosine-5'-triphosphate (ATP) was monitored u...
US Patent US9034866 (2015)
BindingDB Entry DOI: 10.7270/Q2GX49B0