null
SMILES: C[C@H]1Cn2c(nnc2-c2cccnc2)C(=O)N1Cc1cccc(c1Cl)C(F)(F)F
InChI Key: InChIKey=KRUNLDBOHJWLOR-NSHDSACASA-N
Activity Spreadsheet -- Enzyme Inhibition Constant Data from BindingDB
Found 14 hits for monomerid = 160088
Trg + Lig
Ki
nM
ΔG°
kcal/mole
IC50
nM
Kd
nM
EC50/IC50
nM
koff
s-1
kon
M-1s-1
pHTemp
°C
P2X purinoceptor 7
(Homo sapiens (Human))
BDBM160088
(US10047092, 29 | US10053463, 29 | US9040534, 29)
Show SMILES C[C@H]1Cn2c(nnc2-c2cccnc2)C(=O)N1Cc1cccc(c1Cl)C(F)(F)F |r|
Show InChI InChI=1S/C19H15ClF3N5O/c1-11-9-28-16(12-5-3-7-24-8-12)25-26-17(28)18(29)27(11)10-13-4-2-6-14(15(13)20)19(21,22)23/h2-8,11H,9-10H2,1H3/t11-/m0/s1
US Patent
4n/an/an/an/an/an/an/an/a
Janssen Pharmaceutica NV
US Patent
Assay Description
Radioligand binding: human or rat P2X7-1321N1 cells were collected and frozen @ −80° C. On the day of the experiment, cell membrane preparation...
US Patent US9040534 (2015)
BindingDB Entry DOI: 10.7270/Q2JS9P6W
P2X purinoceptor 7
(Homo sapiens (Human))
BDBM160088
(US10047092, 29 | US10053463, 29 | US9040534, 29)
Show SMILES C[C@H]1Cn2c(nnc2-c2cccnc2)C(=O)N1Cc1cccc(c1Cl)C(F)(F)F |r|
Show InChI InChI=1S/C19H15ClF3N5O/c1-11-9-28-16(12-5-3-7-24-8-12)25-26-17(28)18(29)27(11)10-13-4-2-6-14(15(13)20)19(21,22)23/h2-8,11H,9-10H2,1H3/t11-/m0/s1
US Patent
4n/an/an/an/an/an/an/an/a
Janssen Pharmaceutica NV
US Patent
Assay Description
human or rat P2X7-1321N1 cells were collected and frozen @ −80° C. On the day of the experiment, cell membrane preparations were made according...
US Patent US10047092 (2018)
BindingDB Entry DOI: 10.7270/Q27D2X4N
P2X purinoceptor 7
(Homo sapiens (Human))
BDBM160088
(US10047092, 29 | US10053463, 29 | US9040534, 29)
Show SMILES C[C@H]1Cn2c(nnc2-c2cccnc2)C(=O)N1Cc1cccc(c1Cl)C(F)(F)F |r|
Show InChI InChI=1S/C19H15ClF3N5O/c1-11-9-28-16(12-5-3-7-24-8-12)25-26-17(28)18(29)27(11)10-13-4-2-6-14(15(13)20)19(21,22)23/h2-8,11H,9-10H2,1H3/t11-/m0/s1
US Patent
4n/an/an/an/an/an/an/an/a
Janssen Pharmaceutica NV
US Patent
Assay Description
human or rat P2X7-1321N1 cells were collected and frozen @−80° C. On the day of the experiment, cell membrane preparations were made according ...
US Patent US10053463 (2018)
BindingDB Entry DOI: 10.7270/Q2FT8P24
P2X purinoceptor 7
(Rattus norvegicus (Rat))
BDBM160088
(US10047092, 29 | US10053463, 29 | US9040534, 29)
Show SMILES C[C@H]1Cn2c(nnc2-c2cccnc2)C(=O)N1Cc1cccc(c1Cl)C(F)(F)F |r|
Show InChI InChI=1S/C19H15ClF3N5O/c1-11-9-28-16(12-5-3-7-24-8-12)25-26-17(28)18(29)27(11)10-13-4-2-6-14(15(13)20)19(21,22)23/h2-8,11H,9-10H2,1H3/t11-/m0/s1
US Patent
5.60n/an/an/an/an/an/an/an/a
Janssen Pharmaceutica NV
US Patent
Assay Description
human or rat P2X7-1321N1 cells were collected and frozen @ −80° C. On the day of the experiment, cell membrane preparations were made according...
US Patent US10047092 (2018)
BindingDB Entry DOI: 10.7270/Q27D2X4N
P2X purinoceptor 7
(Mus musculus)
BDBM160088
(US10047092, 29 | US10053463, 29 | US9040534, 29)
Show SMILES C[C@H]1Cn2c(nnc2-c2cccnc2)C(=O)N1Cc1cccc(c1Cl)C(F)(F)F |r|
Show InChI InChI=1S/C19H15ClF3N5O/c1-11-9-28-16(12-5-3-7-24-8-12)25-26-17(28)18(29)27(11)10-13-4-2-6-14(15(13)20)19(21,22)23/h2-8,11H,9-10H2,1H3/t11-/m0/s1
US Patent
5.60n/an/an/an/an/an/an/an/a
Janssen Pharmaceutica NV
US Patent
Assay Description
human or rat P2X7-1321N1 cells were collected and frozen @−80° C. On the day of the experiment, cell membrane preparations were made according ...
US Patent US10053463 (2018)
BindingDB Entry DOI: 10.7270/Q2FT8P24
P2X purinoceptor 7
(Rattus norvegicus (Rat))
BDBM160088
(US10047092, 29 | US10053463, 29 | US9040534, 29)
Show SMILES C[C@H]1Cn2c(nnc2-c2cccnc2)C(=O)N1Cc1cccc(c1Cl)C(F)(F)F |r|
Show InChI InChI=1S/C19H15ClF3N5O/c1-11-9-28-16(12-5-3-7-24-8-12)25-26-17(28)18(29)27(11)10-13-4-2-6-14(15(13)20)19(21,22)23/h2-8,11H,9-10H2,1H3/t11-/m0/s1
US Patent
5.60n/an/an/an/an/an/an/an/a
Janssen Pharmaceutica NV
US Patent
Assay Description
Radioligand binding: human or rat P2X7-1321N1 cells were collected and frozen @ −80° C. On the day of the experiment, cell membrane preparation...
US Patent US9040534 (2015)
BindingDB Entry DOI: 10.7270/Q2JS9P6W
P2X purinoceptor 7
(Homo sapiens (Human))
BDBM160088
(US10047092, 29 | US10053463, 29 | US9040534, 29)
Show SMILES C[C@H]1Cn2c(nnc2-c2cccnc2)C(=O)N1Cc1cccc(c1Cl)C(F)(F)F |r|
Show InChI InChI=1S/C19H15ClF3N5O/c1-11-9-28-16(12-5-3-7-24-8-12)25-26-17(28)18(29)27(11)10-13-4-2-6-14(15(13)20)19(21,22)23/h2-8,11H,9-10H2,1H3/t11-/m0/s1
US Patent
n/an/a 1n/an/an/an/a7.4n/a
Janssen Pharmaceutica NV
US Patent
Assay Description
1321N1 cells expressing the recombinant human, rat or mouse P2X7 channel was cultured in HyQ DME/(HyClone/Dulbecco's Modified Eagle Medium) high ...
US Patent US10047092 (2018)
BindingDB Entry DOI: 10.7270/Q27D2X4N
P2X purinoceptor 7
(Homo sapiens (Human))
BDBM160088
(US10047092, 29 | US10053463, 29 | US9040534, 29)
Show SMILES C[C@H]1Cn2c(nnc2-c2cccnc2)C(=O)N1Cc1cccc(c1Cl)C(F)(F)F |r|
Show InChI InChI=1S/C19H15ClF3N5O/c1-11-9-28-16(12-5-3-7-24-8-12)25-26-17(28)18(29)27(11)10-13-4-2-6-14(15(13)20)19(21,22)23/h2-8,11H,9-10H2,1H3/t11-/m0/s1
n/an/a 1.90n/an/an/an/an/an/a
Janssen Pharmaceutical Research& Development L.L.C.
Curated by ChEMBL
Assay Description
Antagonist activity at human P2X7 receptor expressed in 1321N1 cells assessed as inhibition of Bz-ATP-induced Ca2+ flux after 30 mins by FLIPR assay
Bioorg Med Chem Lett 26: 257-61 (2016)
Article DOI: 10.1016/j.bmcl.2015.12.052
BindingDB Entry DOI: 10.7270/Q2MW2K0Z
P2X purinoceptor 7
(Rattus norvegicus (Rat))
BDBM160088
(US10047092, 29 | US10053463, 29 | US9040534, 29)
Show SMILES C[C@H]1Cn2c(nnc2-c2cccnc2)C(=O)N1Cc1cccc(c1Cl)C(F)(F)F |r|
Show InChI InChI=1S/C19H15ClF3N5O/c1-11-9-28-16(12-5-3-7-24-8-12)25-26-17(28)18(29)27(11)10-13-4-2-6-14(15(13)20)19(21,22)23/h2-8,11H,9-10H2,1H3/t11-/m0/s1
n/an/a 88n/an/an/an/an/an/a
Janssen Pharmaceutical Research& Development L.L.C.
Curated by ChEMBL
Assay Description
Antagonist activity at rat P2X7 receptor expressed in 1321N1 cells assessed as inhibition of Bz-ATP-induced Ca2+ flux after 30 mins by FLIPR assay
Bioorg Med Chem Lett 26: 257-61 (2016)
Article DOI: 10.1016/j.bmcl.2015.12.052
BindingDB Entry DOI: 10.7270/Q2MW2K0Z
P2X purinoceptor 7
(Mus musculus)
BDBM160088
(US10047092, 29 | US10053463, 29 | US9040534, 29)
Show SMILES C[C@H]1Cn2c(nnc2-c2cccnc2)C(=O)N1Cc1cccc(c1Cl)C(F)(F)F |r|
Show InChI InChI=1S/C19H15ClF3N5O/c1-11-9-28-16(12-5-3-7-24-8-12)25-26-17(28)18(29)27(11)10-13-4-2-6-14(15(13)20)19(21,22)23/h2-8,11H,9-10H2,1H3/t11-/m0/s1
US Patent
n/an/a 122n/an/an/an/a7.4n/a
Janssen Pharmaceutica NV
US Patent
Assay Description
1321N1 cells expressing the recombinant human or rat P2X7 channel was cultured in HyQ DME/(HyClone/Dulbecco's Modified Eagle Medium) high glucose...
US Patent US10053463 (2018)
BindingDB Entry DOI: 10.7270/Q2FT8P24
P2X purinoceptor 7
(Rattus norvegicus (Rat))
BDBM160088
(US10047092, 29 | US10053463, 29 | US9040534, 29)
Show SMILES C[C@H]1Cn2c(nnc2-c2cccnc2)C(=O)N1Cc1cccc(c1Cl)C(F)(F)F |r|
Show InChI InChI=1S/C19H15ClF3N5O/c1-11-9-28-16(12-5-3-7-24-8-12)25-26-17(28)18(29)27(11)10-13-4-2-6-14(15(13)20)19(21,22)23/h2-8,11H,9-10H2,1H3/t11-/m0/s1
US Patent
n/an/a 122n/an/an/an/a7.4n/a
Janssen Pharmaceutica NV
US Patent
Assay Description
1321N1 cells expressing the recombinant human, rat or mouse P2X7 channel was cultured in HyQ DME/(HyClone/Dulbecco's Modified Eagle Medium) high ...
US Patent US10047092 (2018)
BindingDB Entry DOI: 10.7270/Q27D2X4N
P2X purinoceptor 7
(Rattus norvegicus (Rat))
BDBM160088
(US10047092, 29 | US10053463, 29 | US9040534, 29)
Show SMILES C[C@H]1Cn2c(nnc2-c2cccnc2)C(=O)N1Cc1cccc(c1Cl)C(F)(F)F |r|
Show InChI InChI=1S/C19H15ClF3N5O/c1-11-9-28-16(12-5-3-7-24-8-12)25-26-17(28)18(29)27(11)10-13-4-2-6-14(15(13)20)19(21,22)23/h2-8,11H,9-10H2,1H3/t11-/m0/s1
US Patent
n/an/a 122n/an/an/an/a7.4n/a
Janssen Pharmaceutica NV
US Patent
Assay Description
Ca2+ Flux: 1321N1 cells expressing the recombinant human, rat or mouse P2X7 channel was cultured in HyQ DME/(HyClone/Dulbecco's Modified Eagle Medium...
US Patent US9040534 (2015)
BindingDB Entry DOI: 10.7270/Q2JS9P6W
P2X purinoceptor 7
(Homo sapiens (Human))
BDBM160088
(US10047092, 29 | US10053463, 29 | US9040534, 29)
Show SMILES C[C@H]1Cn2c(nnc2-c2cccnc2)C(=O)N1Cc1cccc(c1Cl)C(F)(F)F |r|
Show InChI InChI=1S/C19H15ClF3N5O/c1-11-9-28-16(12-5-3-7-24-8-12)25-26-17(28)18(29)27(11)10-13-4-2-6-14(15(13)20)19(21,22)23/h2-8,11H,9-10H2,1H3/t11-/m0/s1
US Patent
n/an/a 1n/an/an/an/a7.4n/a
Janssen Pharmaceutica NV
US Patent
Assay Description
Ca2+ Flux: 1321N1 cells expressing the recombinant human, rat or mouse P2X7 channel was cultured in HyQ DME/(HyClone/Dulbecco's Modified Eagle Medium...
US Patent US9040534 (2015)
BindingDB Entry DOI: 10.7270/Q2JS9P6W
P2X purinoceptor 7
(Homo sapiens (Human))
BDBM160088
(US10047092, 29 | US10053463, 29 | US9040534, 29)
Show SMILES C[C@H]1Cn2c(nnc2-c2cccnc2)C(=O)N1Cc1cccc(c1Cl)C(F)(F)F |r|
Show InChI InChI=1S/C19H15ClF3N5O/c1-11-9-28-16(12-5-3-7-24-8-12)25-26-17(28)18(29)27(11)10-13-4-2-6-14(15(13)20)19(21,22)23/h2-8,11H,9-10H2,1H3/t11-/m0/s1
US Patent
n/an/a 1n/an/an/an/a7.4n/a
Janssen Pharmaceutica NV
US Patent
Assay Description
1321N1 cells expressing the recombinant human or rat P2X7 channel was cultured in HyQ DME/(HyClone/Dulbecco's Modified Eagle Medium) high glucose...
US Patent US10053463 (2018)
BindingDB Entry DOI: 10.7270/Q2FT8P24