BDBM164486 US9066954, 336
SMILES: Cc1csc(c1)-c1ccc2nnc(Cc3ccc4ncccc4c3)n2n1
InChI Key: InChIKey=RCAPXRDUKCOQCJ-UHFFFAOYSA-N
Data: 1 KI
Activity Spreadsheet -- Enzyme Inhibition Constant Data from BindingDB
Found 1 hit for monomerid = 164486
Trg + Lig
Ki
nM
ΔG°
kcal/mole
IC50
nM
Kd
nM
EC50/IC50
nM
koff
s-1
kon
M-1s-1
pHTemp
°C
Hepatocyte growth factor receptor
(Homo sapiens (Human))
BDBM164486
(US9066954, 336)
Show SMILES Cc1csc(c1)-c1ccc2nnc(Cc3ccc4ncccc4c3)n2n1
Show InChI InChI=1S/C20H15N5S/c1-13-9-18(26-12-13)17-6-7-19-22-23-20(25(19)24-17)11-14-4-5-16-15(10-14)3-2-8-21-16/h2-10,12H,11H2,1H3
US Patent
0.700 -12.6n/an/an/an/an/a8.027
Amgen Inc.
US Patent
Assay Description
A PCR product covering residues 1058-1365 of c-Met (c-Met kinase domain) is generated from Human Liver QuickClone cDNA (Invitrogen) using forward pri...
US Patent US9066954 (2015)
BindingDB Entry DOI: 10.7270/Q2N878JD