BDBM168043 US9073926, 77
SMILES: C[C@H]1NC(=O)c2cc3ccc(nc3n2[C@H]1C)C(=O)Nc1nc2ccccc2n1CCCN(C)C
InChI Key: InChIKey=HZICFZZGLWKOAR-CVEARBPZSA-N
Data: 1 IC50
Activity Spreadsheet -- Enzyme Inhibition Constant Data from BindingDB
Found 1 hit for monomerid = 168043
Trg + Lig
Ki
nM
ΔG°
kcal/mole
IC50
nM
Kd
nM
EC50/IC50
nM
koff
s-1
kon
M-1s-1
pHTemp
°C
Ribosomal protein S6 kinase alpha-3
(Homo sapiens (Human))
BDBM168043
(US9073926, 77)
Show SMILES C[C@H]1NC(=O)c2cc3ccc(nc3n2[C@H]1C)C(=O)Nc1nc2ccccc2n1CCCN(C)C |r|
Show InChI InChI=1S/C25H29N7O2/c1-15-16(2)32-21(24(34)26-15)14-17-10-11-19(27-22(17)32)23(33)29-25-28-18-8-5-6-9-20(18)31(25)13-7-12-30(3)4/h5-6,8-11,14-16H,7,12-13H2,1-4H3,(H,26,34)(H,28,29,33)/t15-,16+/m1/s1
Reactome pathway
US Patent
n/an/a 29n/an/an/an/a7.5n/a
Boehringer Ingelheim International GmbH
US Patent
Assay Description
Human RSK2 protein, purchased from Invitrogen, is used to measure kinase activity utilizing Kinase Glo Plus (Promega) a homogeneous assay technology,...
US Patent US9073926 (2015)
BindingDB Entry DOI: 10.7270/Q2BP01J6