null
SMILES: CN1CCC2(CC1)NC(=O)c1c(Cl)cc(Nc3ccncn3)c(=O)n21
InChI Key: InChIKey=ZRTRQXQCCPEDSY-UHFFFAOYSA-N
Activity Spreadsheet -- Enzyme Inhibition Constant Data from BindingDB
Found 2 hits for monomerid = 168303
Trg + Lig
Ki
nM
ΔG°
kcal/mole
IC50
nM
Kd
nM
EC50/IC50
nM
koff
s-1
kon
M-1s-1
pHTemp
°C
MAP kinase-interacting serine/threonine-protein kinase 2
(Homo sapiens (Human))
BDBM168303
(US9669031, 129 8-chloro-1′-methyl-6-(pyrimid...)
Show SMILES CN1CCC2(CC1)NC(=O)c1c(Cl)cc(Nc3ccncn3)c(=O)n21
Show InChI InChI=1S/C16H17ClN6O2/c1-22-6-3-16(4-7-22)21-14(24)13-10(17)8-11(15(25)23(13)16)20-12-2-5-18-9-19-12/h2,5,8-9H,3-4,6-7H2,1H3,(H,21,24)(H,18,19,20)
US Patent
n/an/a<10n/an/an/an/an/a25
eFFECTOR THERAPEUTICS, INC.
US Patent
Assay Description
Compounds are screened for Mnk inhibition using the ADP-Glo kinase assay kit (Promega, catalogue No. V9101). All kinase reactions are performed in Re...
US Patent US9669031 (2017)
BindingDB Entry DOI: 10.7270/Q26Q1VDT
MAP kinase-interacting serine/threonine-protein kinase 1
(Homo sapiens (Human))
BDBM168303
(US9669031, 129 8-chloro-1′-methyl-6-(pyrimid...)
Show SMILES CN1CCC2(CC1)NC(=O)c1c(Cl)cc(Nc3ccncn3)c(=O)n21
Show InChI InChI=1S/C16H17ClN6O2/c1-22-6-3-16(4-7-22)21-14(24)13-10(17)8-11(15(25)23(13)16)20-12-2-5-18-9-19-12/h2,5,8-9H,3-4,6-7H2,1H3,(H,21,24)(H,18,19,20)
NCI pathway
Reactome pathway
US Patent
n/an/a<10n/an/an/an/an/a25
eFFECTOR THERAPEUTICS, INC.
US Patent
Assay Description
Compounds are screened for Mnk inhibition using the ADP-Glo kinase assay kit (Promega, catalogue No. V9101). All kinase reactions are performed in Re...
US Patent US9669031 (2017)
BindingDB Entry DOI: 10.7270/Q26Q1VDT