null
SMILES: Fc1ccc(cc1)-c1c(-c2ccc(OC(F)(F)F)cc2)c(=O)c1=O
InChI Key: InChIKey=FROJVFCEHHYKBC-UHFFFAOYSA-N
Activity Spreadsheet -- Enzyme Inhibition Constant Data from BindingDB
Found 1 hit for monomerid = 172589
Trg + Lig
Ki
nM
ΔG°
kcal/mole
IC50
nM
Kd
nM
EC50/IC50
nM
koff
s-1
kon
M-1s-1
pHTemp
°C
Endothelin-1
(Homo sapiens (Human))
BDBM172589
(US9675593, 666)
Show SMILES Fc1ccc(cc1)-c1c(-c2ccc(OC(F)(F)F)cc2)c(=O)c1=O
Show InChI InChI=1S/C17H8F4O3/c18-11-5-1-9(2-6-11)13-14(16(23)15(13)22)10-3-7-12(8-4-10)24-17(19,20)21/h1-8H
US Patent
n/an/an/an/a<5.00E+4n/an/an/an/a
SRMLSC
US Patent
Assay Description
Fibroblasts (primary human lung and dermal, HFL-1, 3T3 etc) are seeded in 96-well plates at ~15000 cells/well and serum starved for 0-48 hours. After...
US Patent US9675593 (2017)
BindingDB Entry DOI: 10.7270/Q2319T24