null
SMILES: Fc1ccc(cc1)-c1cn(-c2ccc(OC(F)(F)F)cc2)c(=O)c2[nH]ncc12
InChI Key: InChIKey=FGXWRHOUBRXNDQ-UHFFFAOYSA-N
Activity Spreadsheet -- Enzyme Inhibition Constant Data from BindingDB
Found 1 hit for monomerid = 172824
Trg + Lig
Ki
nM
ΔG°
kcal/mole
IC50
nM
Kd
nM
EC50/IC50
nM
koff
s-1
kon
M-1s-1
pHTemp
°C
Endothelin-1
(Homo sapiens (Human))
BDBM172824
(US9675593, 689)
Show SMILES Fc1ccc(cc1)-c1cn(-c2ccc(OC(F)(F)F)cc2)c(=O)c2[nH]ncc12
Show InChI InChI=1S/C19H11F4N3O2/c20-12-3-1-11(2-4-12)16-10-26(18(27)17-15(16)9-24-25-17)13-5-7-14(8-6-13)28-19(21,22)23/h1-10H,(H,24,25)
US Patent
n/an/an/an/a<5.00E+4n/an/an/an/a
SRMLSC
US Patent
Assay Description
Fibroblasts (primary human lung and dermal, HFL-1, 3T3 etc) are seeded in 96-well plates at ~15000 cells/well and serum starved for 0-48 hours. After...
US Patent US9675593 (2017)
BindingDB Entry DOI: 10.7270/Q2319T24