BDBM173968 US9688661, 3-(5-Chloro-2-methylphenyl)-5-(7H-pyrrolo[2,3-d]pyrimidin-4-yl)-1H-pyrrole-2-carboxamide (compd 123)
SMILES: Cc1ccc(Cl)cc1-c1cc(nc1C(N)=O)-c1ncnc2[nH]ccc12
InChI Key: InChIKey=HAKZDKNTSAPKJO-UHFFFAOYSA-N
Data: 3 IC50
Activity Spreadsheet -- Enzyme Inhibition Constant Data from BindingDB
Found 3 hits for monomerid = 173968
Trg + Lig
Ki
nM
ΔG°
kcal/mole
IC50
nM
Kd
nM
EC50/IC50
nM
koff
s-1
kon
M-1s-1
pHTemp
°C
Tyrosine-protein kinase JAK1 (JAK1)
(Homo sapiens (Human))
BDBM173968
(US9688661, 3-(5-Chloro-2-methylphenyl)-5-(7H-pyrro...)
Show SMILES Cc1ccc(Cl)cc1-c1cc(nc1C(N)=O)-c1ncnc2[nH]ccc12
Show InChI InChI=1S/C18H13ClN5O/c1-9-2-3-10(19)6-12(9)13-7-14(24-16(13)17(20)25)15-11-4-5-21-18(11)23-8-22-15/h2-8H,1H3,(H2,20,25)(H,21,22,23)
US Patent
n/an/a 33n/an/an/an/an/an/a
NERVIANO MEDICAL SCIENCES S.R.L.
US Patent
Assay Description
Assays were performed with the JAK1 kinase domain (residues 861-1152 of the 1154 amino acid long full-length sequence, accession number P23458 of Uni...
US Patent US9688661 (2017)
BindingDB Entry DOI: 10.7270/Q2K35RTP
Non-receptor tyrosine-protein kinase TYK2 (TYK2)
(Homo sapiens (Human))
BDBM173968
(US9688661, 3-(5-Chloro-2-methylphenyl)-5-(7H-pyrro...)
Show SMILES Cc1ccc(Cl)cc1-c1cc(nc1C(N)=O)-c1ncnc2[nH]ccc12
Show InChI InChI=1S/C18H13ClN5O/c1-9-2-3-10(19)6-12(9)13-7-14(24-16(13)17(20)25)15-11-4-5-21-18(11)23-8-22-15/h2-8H,1H3,(H2,20,25)(H,21,22,23)
US Patent
n/an/a 23n/an/an/an/an/an/a
NERVIANO MEDICAL SCIENCES S.R.L.
US Patent
Assay Description
Assays were performed with the TYK2 kinase domain (residues 833-1187 of the 1187 amino acid long full-length sequence, accession number P29597 of Uni...
US Patent US9688661 (2017)
BindingDB Entry DOI: 10.7270/Q2K35RTP
Tyrosine-protein kinase JAK2
(Homo sapiens (Human))
BDBM173968
(US9688661, 3-(5-Chloro-2-methylphenyl)-5-(7H-pyrro...)
Show SMILES Cc1ccc(Cl)cc1-c1cc(nc1C(N)=O)-c1ncnc2[nH]ccc12
Show InChI InChI=1S/C18H13ClN5O/c1-9-2-3-10(19)6-12(9)13-7-14(24-16(13)17(20)25)15-11-4-5-21-18(11)23-8-22-15/h2-8H,1H3,(H2,20,25)(H,21,22,23)
Reactome pathway
US Patent
n/an/a 5n/an/an/an/an/an/a
NERVIANO MEDICAL SCIENCES S.R.L.
US Patent
Assay Description
Assays were performed with the commercially available JAK2 kinase domain (Invitrogen, Eugene, Oreg.) that showed a linear kinetic without prephosphor...
US Patent US9688661 (2017)
BindingDB Entry DOI: 10.7270/Q2K35RTP