BDBM1757 2-Amino-6-arylthiobenzonitrile deriv. 2b::2-amino-6-[(3-methoxybenzene)sulfinyl]benzonitrile::CHEMBL55007
SMILES: COc1cccc(c1)S(=O)c1cccc(N)c1C#N
InChI Key: InChIKey=DTAPEXKJTDIXLQ-UHFFFAOYSA-N
Data: 2 IC50
Activity Spreadsheet -- Enzyme Inhibition Constant Data from BindingDB
Found 2 hits for monomerid = 1757
Trg + Lig
Ki
nM
ΔG°
kcal/mole
IC50
nM
Kd
nM
EC50/IC50
nM
koff
s-1
kon
M-1s-1
pHTemp
°C
Human immunodeficiency virus type 1 reverse transcriptase
(Human immunodeficiency virus 1)
BDBM1757
(2-Amino-6-arylthiobenzonitrile deriv. 2b | 2-amino...)
Show SMILES COc1cccc(c1)S(=O)c1cccc(N)c1C#N
Show InChI InChI=1S/C14H12N2O2S/c1-18-10-4-2-5-11(8-10)19(17)14-7-3-6-13(16)12(14)9-15/h2-8H,16H2,1H3
n/an/a 1.91E+4n/an/an/an/an/an/a
University of Perugia
Curated by ChEMBL
Assay Description
Inhibitory concentration against Reverse transcriptase
J Med Chem 48: 3756-67 (2005)
Article DOI: 10.1021/jm049162m
BindingDB Entry DOI: 10.7270/Q2XS5WQ0
HIV-1 Reverse Transcriptase
(Human immunodeficiency virus type 1)
BDBM1757
(2-Amino-6-arylthiobenzonitrile deriv. 2b | 2-amino...)
Show SMILES COc1cccc(c1)S(=O)c1cccc(N)c1C#N
Show InChI InChI=1S/C14H12N2O2S/c1-18-10-4-2-5-11(8-10)19(17)14-7-3-6-13(16)12(14)9-15/h2-8H,16H2,1H3
n/an/a 1.90E+4n/an/an/an/an/an/a
GlaxoSmithKline
Assay Description
The IC50 of reverse transcriptase is the concentration that inhibits 50% of recombinant HIV-1 RT RNA-directed DNA polymerase activity in vitro.
J Med Chem 44: 1866-82 (2001)
Article DOI: 10.1021/jm0004906
BindingDB Entry DOI: 10.7270/Q2FJ2F09