BDBM176553 US9120756, 15
SMILES: C[C@H](C(=O)NCc1cc(nn1-c1ccc(Cl)cc1)C(C)(C)C)c1ccc(NS(C)(=O)=O)c(F)c1
InChI Key: InChIKey=ZIBSWPPDDLFJFV-HNNXBMFYSA-N
Data: 2 KI
Activity Spreadsheet -- Enzyme Inhibition Constant Data from BindingDB
Found 2 hits for monomerid = 176553
Trg + Lig
Ki
nM
ΔG°
kcal/mole
IC50
nM
Kd
nM
EC50/IC50
nM
koff
s-1
kon
M-1s-1
pHTemp
°C
Transient receptor potential cation channel subfamily V member 1
(Homo sapiens (Human))
BDBM176553
(US9120756, 15)
Show SMILES C[C@H](C(=O)NCc1cc(nn1-c1ccc(Cl)cc1)C(C)(C)C)c1ccc(NS(C)(=O)=O)c(F)c1
Show InChI InChI=1S/C24H28ClFN4O3S/c1-15(16-6-11-21(20(26)12-16)29-34(5,32)33)23(31)27-14-19-13-22(24(2,3)4)28-30(19)18-9-7-17(25)8-10-18/h6-13,15,29H,14H2,1-5H3,(H,27,31)/t15-/m0/s1
Reactome pathway
US Patent
2.10 -12.3n/an/an/an/an/an/a37
Gruenenthal GmbH
US Patent
Assay Description
The agonistic or antagonistic effect of the substances to be tested on the vanilloid receptor 1 (VR1) can also be determined using the following assa...
US Patent US9120756 (2015)
BindingDB Entry DOI: 10.7270/Q26D5RRG
Transient receptor potential cation channel subfamily V member 1
(Rattus norvegicus (rat))
BDBM176553
(US9120756, 15)
Show SMILES C[C@H](C(=O)NCc1cc(nn1-c1ccc(Cl)cc1)C(C)(C)C)c1ccc(NS(C)(=O)=O)c(F)c1
Show InChI InChI=1S/C24H28ClFN4O3S/c1-15(16-6-11-21(20(26)12-16)29-34(5,32)33)23(31)27-14-19-13-22(24(2,3)4)28-30(19)18-9-7-17(25)8-10-18/h6-13,15,29H,14H2,1-5H3,(H,27,31)/t15-/m0/s1
Reactome pathway
US Patent
2.5n/an/an/an/an/an/an/an/a
Gruenenthal GmbH
US Patent
Assay Description
The agonistic or antagonistic effect of the substances to be tested on the rat-species vanilloid receptor 1 (VR1/TRPV1) can be determined using the f...
US Patent US9120756 (2015)
BindingDB Entry DOI: 10.7270/Q26D5RRG