BDBM17716 2,3-Diarylfuro[2,3-b]pyridine-4-amine, 8::2,3-diphenyl-N-[2-(piperazin-1-yl)ethyl]furo[2,3-b]pyridin-4-amine
SMILES: C(CN1CCNCC1)Nc1ccnc2oc(c(-c3ccccc3)c12)-c1ccccc1
InChI Key: InChIKey=QUIQCYFSBGOBKE-UHFFFAOYSA-N
Data: 4 IC50
PDB links: 1 PDB ID matches this monomer.
Activity Spreadsheet -- Enzyme Inhibition Constant Data from BindingDB
Found 4 hits for monomerid = 17716
Trg + Lig
Ki
nM
ΔG°
kcal/mole
IC50
nM
Kd
nM
EC50/IC50
nM
koff
s-1
kon
M-1s-1
pHTemp
°C
Vascular endothelial growth factor receptor 2
(Homo sapiens (Human))
BDBM17716
(2,3-Diarylfuro[2,3-b]pyridine-4-amine, 8 | 2,3-dip...)
Show SMILES C(CN1CCNCC1)Nc1ccnc2oc(c(-c3ccccc3)c12)-c1ccccc1
Show InChI InChI=1S/C25H26N4O/c1-3-7-19(8-4-1)22-23-21(27-15-18-29-16-13-26-14-17-29)11-12-28-25(23)30-24(22)20-9-5-2-6-10-20/h1-12,26H,13-18H2,(H,27,28)
NCI pathway
Reactome pathway
n/an/a 360n/an/an/an/a7.522
Amgen
Assay Description
The assay involves the phosphorylation of a biotinylated substrate and the detection of this phosphorylation after the addition of a streptavidin-all...
Bioorg Med Chem Lett 17: 2299-304 (2007)
Article DOI: 10.1016/j.bmcl.2007.01.048
BindingDB Entry DOI: 10.7270/Q2X34VQ9
Tyrosine-protein kinase JAK3
(Homo sapiens (Human))
BDBM17716
(2,3-Diarylfuro[2,3-b]pyridine-4-amine, 8 | 2,3-dip...)
Show SMILES C(CN1CCNCC1)Nc1ccnc2oc(c(-c3ccccc3)c12)-c1ccccc1
Show InChI InChI=1S/C25H26N4O/c1-3-7-19(8-4-1)22-23-21(27-15-18-29-16-13-26-14-17-29)11-12-28-25(23)30-24(22)20-9-5-2-6-10-20/h1-12,26H,13-18H2,(H,27,28)
Reactome pathway
n/an/a 140n/an/an/an/an/an/a
Amgen
Assay Description
The assay involves the phosphorylation of a biotinylated substrate and the detection of this phosphorylation after the addition of a streptavidin-all...
Bioorg Med Chem Lett 17: 2299-304 (2007)
Article DOI: 10.1016/j.bmcl.2007.01.048
BindingDB Entry DOI: 10.7270/Q2X34VQ9
Tyrosine kinase non-receptor protein 2
(Homo sapiens (Human))
BDBM17716
(2,3-Diarylfuro[2,3-b]pyridine-4-amine, 8 | 2,3-dip...)
Show SMILES C(CN1CCNCC1)Nc1ccnc2oc(c(-c3ccccc3)c12)-c1ccccc1
Show InChI InChI=1S/C25H26N4O/c1-3-7-19(8-4-1)22-23-21(27-15-18-29-16-13-26-14-17-29)11-12-28-25(23)30-24(22)20-9-5-2-6-10-20/h1-12,26H,13-18H2,(H,27,28)
n/an/a 420n/an/an/an/an/an/a
Amgen
Assay Description
The assay involves the phosphorylation of a biotinylated substrate and the detection of this phosphorylation after the addition of a streptavidin-all...
Bioorg Med Chem Lett 17: 2299-304 (2007)
Article DOI: 10.1016/j.bmcl.2007.01.048
BindingDB Entry DOI: 10.7270/Q2X34VQ9
Tyrosine-protein kinase Lck
(Homo sapiens (Human))
BDBM17716
(2,3-Diarylfuro[2,3-b]pyridine-4-amine, 8 | 2,3-dip...)
Show SMILES C(CN1CCNCC1)Nc1ccnc2oc(c(-c3ccccc3)c12)-c1ccccc1
Show InChI InChI=1S/C25H26N4O/c1-3-7-19(8-4-1)22-23-21(27-15-18-29-16-13-26-14-17-29)11-12-28-25(23)30-24(22)20-9-5-2-6-10-20/h1-12,26H,13-18H2,(H,27,28)
n/an/a 210n/an/an/an/a7.522
Amgen
Assay Description
The assay involves the phosphorylation of a biotinylated substrate and the detection of this phosphorylation after the addition of a streptavidin-all...
Bioorg Med Chem Lett 17: 2299-304 (2007)
Article DOI: 10.1016/j.bmcl.2007.01.048
BindingDB Entry DOI: 10.7270/Q2X34VQ9
3D
3D Structure (crystal)