BDBM17947 (2R,4S,5S,7R)-5-amino-N-butyl-4-hydroxy-8-{[2-(3-methoxypropoxy)phenyl]formamido}-2,7-dimethyloctanamide::Renin nonpeptide inhibitor, 7
SMILES: CCCCNC(=O)[C@H](C)C[C@H](O)[C@@H](N)C[C@@H](C)CNC(=O)c1ccccc1OCCCOC
InChI Key: InChIKey=HCEVFKSMFFEYMG-WKDRNLAYSA-N
Data: 2 IC50
PDB links: 1 PDB ID matches this monomer. 1 PDB ID contains this monomer as substructures. 1 PDB ID contains inhibitors having a similarity of 90% to this monomer.
Activity Spreadsheet -- Enzyme Inhibition Constant Data from BindingDB
Found 2 hits for monomerid = 17947
Trg + Lig
Ki
nM
ΔG°
kcal/mole
IC50
nM
Kd
nM
EC50/IC50
nM
koff
s-1
kon
M-1s-1
pHTemp
°C
Pepsin A
(Porcine)
BDBM17947
((2R,4S,5S,7R)-5-amino-N-butyl-4-hydroxy-8-{[2-(3-m...)
Show SMILES CCCCNC(=O)[C@H](C)C[C@H](O)[C@@H](N)C[C@@H](C)CNC(=O)c1ccccc1OCCCOC |r|
Show InChI InChI=1S/C25H43N3O5/c1-5-6-12-27-24(30)19(3)16-22(29)21(26)15-18(2)17-28-25(31)20-10-7-8-11-23(20)33-14-9-13-32-4/h7-8,10-11,18-19,21-22,29H,5-6,9,12-17,26H2,1-4H3,(H,27,30)(H,28,31)/t18-,19-,21+,22+/m1/s1
n/an/a>1.00E+5n/an/an/an/a2.037
Novartis Pharmaceuticals
Assay Description
In vitro potencies of compounds against purified porcine pepsin were determined by its cleavage of substrate hemoglobin. After incubation, proteins w...
Chem Biol 7: 493-504 (2000)
Article DOI: 10.1016/S1074-5521(00)00134-4
BindingDB Entry DOI: 10.7270/Q2V40SGJ
Renin
(Homo sapiens (Human))
BDBM17947
((2R,4S,5S,7R)-5-amino-N-butyl-4-hydroxy-8-{[2-(3-m...)
Show SMILES CCCCNC(=O)[C@H](C)C[C@H](O)[C@@H](N)C[C@@H](C)CNC(=O)c1ccccc1OCCCOC |r|
Show InChI InChI=1S/C25H43N3O5/c1-5-6-12-27-24(30)19(3)16-22(29)21(26)15-18(2)17-28-25(31)20-10-7-8-11-23(20)33-14-9-13-32-4/h7-8,10-11,18-19,21-22,29H,5-6,9,12-17,26H2,1-4H3,(H,27,30)(H,28,31)/t18-,19-,21+,22+/m1/s1
Reactome pathway
n/an/a 22n/an/an/an/a7.237
Novartis Pharmaceuticals
Assay Description
In vitro potencies of compounds against purified human recombinant renin were determined by its cleavage of substrate angiotensinogen. The angiotensi...
Chem Biol 7: 493-504 (2000)
Article DOI: 10.1016/S1074-5521(00)00134-4
BindingDB Entry DOI: 10.7270/Q2V40SGJ
3D
3D Structure (crystal)