BDBM185839 US9163007, 87
SMILES: C(c1ccccc1)n1nnc(c1-c1ccccc1)-c1ccc2[nH]ncc2c1
InChI Key: InChIKey=IOYGZJJCJBOPDM-UHFFFAOYSA-N
Data: 1 KI
Activity Spreadsheet -- Enzyme Inhibition Constant Data from BindingDB
Found 1 hit for monomerid = 185839
Trg + Lig
Ki
nM
ΔG°
kcal/mole
IC50
nM
Kd
nM
EC50/IC50
nM
koff
s-1
kon
M-1s-1
pHTemp
°C
Cell division cycle 7-related protein kinase
(Homo sapiens (Human))
BDBM185839
(US9163007, 87)
Show SMILES C(c1ccccc1)n1nnc(c1-c1ccccc1)-c1ccc2[nH]ncc2c1
Show InChI InChI=1S/C22H17N5/c1-3-7-16(8-4-1)15-27-22(17-9-5-2-6-10-17)21(25-26-27)18-11-12-20-19(13-18)14-23-24-20/h1-14H,15H2,(H,23,24)
Reactome pathway
US Patent
0.601n/an/an/an/an/an/a7.5n/a
AbbVie Inc.
US Patent
Assay Description
11 data point. Cdc7 kinase assays were carried out in 25 mM HEPES, pH 7.5, 1 mM DTT, 10 mM MgCl2, 100 μM Na3VO4, and 0.075 mg/ml Triton X-100 u...
US Patent US9163007 (2015)
BindingDB Entry DOI: 10.7270/Q2KW5DTG