BDBM185894 US9163007, 401
SMILES: C(c1ccccc1)n1cc(nn1)-c1ccc2[nH]nc(-c3cccs3)c2c1
InChI Key: InChIKey=ZWUXUMQBVYFEMZ-UHFFFAOYSA-N
Data: 1 KI
Activity Spreadsheet -- Enzyme Inhibition Constant Data from BindingDB
Found 1 hit for monomerid = 185894
Trg + Lig
Ki
nM
ΔG°
kcal/mole
IC50
nM
Kd
nM
EC50/IC50
nM
koff
s-1
kon
M-1s-1
pHTemp
°C
Cell division cycle 7-related protein kinase
(Homo sapiens (Human))
BDBM185894
(US9163007, 401)
Show SMILES C(c1ccccc1)n1cc(nn1)-c1ccc2[nH]nc(-c3cccs3)c2c1
Show InChI InChI=1S/C20H15N5S/c1-2-5-14(6-3-1)12-25-13-18(22-24-25)15-8-9-17-16(11-15)20(23-21-17)19-7-4-10-26-19/h1-11,13H,12H2,(H,21,23)
Reactome pathway
US Patent
4.92n/an/an/an/an/an/a7.5n/a
AbbVie Inc.
US Patent
Assay Description
11 data point. Cdc7 kinase assays were carried out in 25 mM HEPES, pH 7.5, 1 mM DTT, 10 mM MgCl2, 100 μM Na3VO4, and 0.075 mg/ml Triton X-100 u...
US Patent US9163007 (2015)
BindingDB Entry DOI: 10.7270/Q2KW5DTG