BDBM185909 US9163007, 416
SMILES: Fc1ccc(CNc2n[nH]c3ccc(cc23)-c2cn(Cc3ccccc3)nn2)c(F)c1
InChI Key: InChIKey=XZAMYBUMHZTQDY-UHFFFAOYSA-N
Data: 1 KI
Activity Spreadsheet -- Enzyme Inhibition Constant Data from BindingDB
Found 1 hit for monomerid = 185909
Trg + Lig
Ki
nM
ΔG°
kcal/mole
IC50
nM
Kd
nM
EC50/IC50
nM
koff
s-1
kon
M-1s-1
pHTemp
°C
Cell division cycle 7-related protein kinase
(Homo sapiens (Human))
BDBM185909
(US9163007, 416)
Show SMILES Fc1ccc(CNc2n[nH]c3ccc(cc23)-c2cn(Cc3ccccc3)nn2)c(F)c1
Show InChI InChI=1S/C23H18F2N6/c24-18-8-6-17(20(25)11-18)12-26-23-19-10-16(7-9-21(19)27-29-23)22-14-31(30-28-22)13-15-4-2-1-3-5-15/h1-11,14H,12-13H2,(H2,26,27,29)
Reactome pathway
US Patent
37n/an/an/an/an/an/a7.5n/a
AbbVie Inc.
US Patent
Assay Description
11 data point. Cdc7 kinase assays were carried out in 25 mM HEPES, pH 7.5, 1 mM DTT, 10 mM MgCl2, 100 μM Na3VO4, and 0.075 mg/ml Triton X-100 u...
US Patent US9163007 (2015)
BindingDB Entry DOI: 10.7270/Q2KW5DTG