null
SMILES: OCCN(CC(F)(F)F)c1ccc2[nH]c(=O)cc(c2c1)C(F)(F)F
InChI Key: InChIKey=PFPIAAVBEPSGTQ-UHFFFAOYSA-N
Activity Spreadsheet -- Enzyme Inhibition Constant Data from BindingDB
Found 1 hit for monomerid = 18593
Trg + Lig
Ki
nM
ΔG°
kcal/mole
IC50
nM
Kd
nM
EC50/IC50
nM
koff
s-1
kon
M-1s-1
pHTemp
°C
Androgen receptor
(Homo sapiens (Human))
BDBM18593
(6-[(2-hydroxyethyl)(2,2,2-trifluoroethyl)amino]-4-...)
Show SMILES OCCN(CC(F)(F)F)c1ccc2[nH]c(=O)cc(c2c1)C(F)(F)F
Show InChI InChI=1S/C14H12F6N2O2/c15-13(16,17)7-22(3-4-23)8-1-2-11-9(5-8)10(14(18,19)20)6-12(24)21-11/h1-2,5-6,23H,3-4,7H2,(H,21,24)
NCI pathway
Reactome pathway
6.60 -11.6n/an/a 7.90n/an/a7.437
Ligand Pharmaceuticals Inc.
Assay Description
The compounds were evaluated in a transcriptional activation assay with hAR in a mammalian cell background (CV-1) as the primary in vitro assay. Rece...
Bioorg Med Chem Lett 17: 1527-31 (2007)
Article DOI: 10.1016/j.bmcl.2007.01.001
BindingDB Entry DOI: 10.7270/Q2XS5SP9