BDBM18694 (2S)-3-[(3-aminophenyl)sulfanyl]-N-[4-cyano-3-(trifluoromethyl)phenyl]-2-hydroxy-2-methylpropanamide::Bicalutamide Analogue, (S)-6
SMILES: C[C@@](O)(CSc1cccc(N)c1)C(=O)Nc1ccc(C#N)c(c1)C(F)(F)F
InChI Key: InChIKey=QNFYWRWLVYZGOG-QGZVFWFLSA-N
Data: 1 KI
Activity Spreadsheet -- Enzyme Inhibition Constant Data from BindingDB
Found 1 hit for monomerid = 18694
Trg + Lig
Ki
nM
ΔG°
kcal/mole
IC50
nM
Kd
nM
EC50/IC50
nM
koff
s-1
kon
M-1s-1
pHTemp
°C
Androgen receptor
(Rattus norvegicus (Rat))
BDBM18694
((2S)-3-[(3-aminophenyl)sulfanyl]-N-[4-cyano-3-(tri...)
Show SMILES C[C@@](O)(CSc1cccc(N)c1)C(=O)Nc1ccc(C#N)c(c1)C(F)(F)F |r|
Show InChI InChI=1S/C18H16F3N3O2S/c1-17(26,10-27-14-4-2-3-12(23)7-14)16(25)24-13-6-5-11(9-22)15(8-13)18(19,20)21/h2-8,26H,10,23H2,1H3,(H,24,25)/t17-/m1/s1
Reactome pathway
>1.00E+3>-7.60n/an/an/an/an/a7.44
University of Tennessee at Memphis
Assay Description
The Ki values were determined by the application of the Cheng-Prusoff equation: Ki = (IC50 x Kd)/(Kd+[L]) where [L] is the concentration of [3H]MIB (...
J Med Chem 43: 581-90 (2000)
Article DOI: 10.1021/jm990027x
BindingDB Entry DOI: 10.7270/Q2DR2SR2