BDBM188808 US9169260, 74
SMILES: CC(C)N1CCC(CC1)c1cc(NC(=O)c2cnn3cccnc23)n(n1)-c1ccc(cc1F)C1CC1
InChI Key: InChIKey=AUKFLCXWCUBZOW-UHFFFAOYSA-N
Data: 2 IC50
PDB links: 1 PDB ID matches this monomer.
Activity Spreadsheet -- Enzyme Inhibition Constant Data from BindingDB
Found 2 hits for monomerid = 188808
Trg + Lig
Ki
nM
ΔG°
kcal/mole
IC50
nM
Kd
nM
EC50/IC50
nM
koff
s-1
kon
M-1s-1
pHTemp
°C
Interleukin-1 receptor-associated kinase 4
(Homo sapiens (Human))
BDBM188808
(US9169260, 74)
Show SMILES CC(C)N1CCC(CC1)c1cc(NC(=O)c2cnn3cccnc23)n(n1)-c1ccc(cc1F)C1CC1
Show InChI InChI=1S/C27H30FN7O/c1-17(2)33-12-8-19(9-13-33)23-15-25(31-27(36)21-16-30-34-11-3-10-29-26(21)34)35(32-23)24-7-6-20(14-22(24)28)18-4-5-18/h3,6-7,10-11,14-19H,4-5,8-9,12-13H2,1-2H3,(H,31,36)
Reactome pathway
n/an/a 13n/an/an/an/an/an/a
Merck Research Laboratories
Curated by ChEMBL
Assay Description
Inhibition of recombinant N-terminal GST-tagged full length human IRAK4 expressed in baculovirus-infected insect Sf9 cells using 5FAM-RKRQGSVRRRVH-CO...
ACS Med Chem Lett 6: 677-82 (2015)
Article DOI: 10.1021/acsmedchemlett.5b00106
BindingDB Entry DOI: 10.7270/Q2G73GGK
3D
3D Structure (crystal)
Interleukin-1 receptor-associated kinase 4
(Homo sapiens (Human))
BDBM188808
(US9169260, 74)
Show SMILES CC(C)N1CCC(CC1)c1cc(NC(=O)c2cnn3cccnc23)n(n1)-c1ccc(cc1F)C1CC1
Show InChI InChI=1S/C27H30FN7O/c1-17(2)33-12-8-19(9-13-33)23-15-25(31-27(36)21-16-30-34-11-3-10-29-26(21)34)35(32-23)24-7-6-20(14-22(24)28)18-4-5-18/h3,6-7,10-11,14-19H,4-5,8-9,12-13H2,1-2H3,(H,31,36)
Reactome pathway
US Patent
n/an/a<100n/an/an/an/a7.2n/a
MERCK SHARP & DOHME CORP.
US Patent
Assay Description
The kinase activity of IRAK-4 is determined by its ability to catalyze the phosphorylation of a fluorescent polypeptide substrate. The extent of phos...
US Patent US9169260 (2015)
BindingDB Entry DOI: 10.7270/Q26H4G6N
3D
3D Structure (crystal)