BDBM18924 2-(3,5-dichloro-4-{4-hydroxy-3-[3-(propan-2-yl)phenyl]phenoxy}phenyl)acetic acid::4-hydroxy thyromimetic, 9f
SMILES: CC(C)c1cccc(c1)-c1cc(Oc2c(Cl)cc(CC(O)=O)cc2Cl)ccc1O
InChI Key: InChIKey=JDRBJNQCUWNMPX-UHFFFAOYSA-N
Data: 5 IC50
Activity Spreadsheet -- Enzyme Inhibition Constant Data from BindingDB
Found 5 hits for monomerid = 18924
Trg + Lig
Ki
nM
ΔG°
kcal/mole
IC50
nM
Kd
nM
EC50/IC50
nM
koff
s-1
kon
M-1s-1
pHTemp
°C
Thyroid hormone receptor alpha
(Homo sapiens (Human))
BDBM18924
(2-(3,5-dichloro-4-{4-hydroxy-3-[3-(propan-2-yl)phe...)
Show SMILES CC(C)c1cccc(c1)-c1cc(Oc2c(Cl)cc(CC(O)=O)cc2Cl)ccc1O
Show InChI InChI=1S/C23H20Cl2O4/c1-13(2)15-4-3-5-16(11-15)18-12-17(6-7-21(18)26)29-23-19(24)8-14(9-20(23)25)10-22(27)28/h3-9,11-13,26H,10H2,1-2H3,(H,27,28)
NCI pathway
Reactome pathway
n/an/a 124n/an/an/an/a7.04
Bristol-Myers Squibb
Assay Description
IC50 is the concentration of each compound required to inhibit 50% binding of 125I-T3 to hTRalpha.
Bioorg Med Chem Lett 14: 3549-53 (2004)
Article DOI: 10.1016/j.bmcl.2004.04.032
BindingDB Entry DOI: 10.7270/Q2736P5M
Thyroid hormone receptor beta
(Homo sapiens (Human))
BDBM18924
(2-(3,5-dichloro-4-{4-hydroxy-3-[3-(propan-2-yl)phe...)
Show SMILES CC(C)c1cccc(c1)-c1cc(Oc2c(Cl)cc(CC(O)=O)cc2Cl)ccc1O
Show InChI InChI=1S/C23H20Cl2O4/c1-13(2)15-4-3-5-16(11-15)18-12-17(6-7-21(18)26)29-23-19(24)8-14(9-20(23)25)10-22(27)28/h3-9,11-13,26H,10H2,1-2H3,(H,27,28)
NCI pathway
Reactome pathway
n/an/a 4n/an/an/an/an/an/a
Bristol-Myers Squibb
Assay Description
IC50 is the concentration of each compound required to inhibit 50% binding of 125I-T3 to hTRbeta.
Bioorg Med Chem Lett 14: 3549-53 (2004)
Article DOI: 10.1016/j.bmcl.2004.04.032
BindingDB Entry DOI: 10.7270/Q2736P5M
3D
3D Structure (docked)
Thyroid hormone receptor beta
(Homo sapiens (Human))
BDBM18924
(2-(3,5-dichloro-4-{4-hydroxy-3-[3-(propan-2-yl)phe...)
Show SMILES CC(C)c1cccc(c1)-c1cc(Oc2c(Cl)cc(CC(O)=O)cc2Cl)ccc1O
Show InChI InChI=1S/C23H20Cl2O4/c1-13(2)15-4-3-5-16(11-15)18-12-17(6-7-21(18)26)29-23-19(24)8-14(9-20(23)25)10-22(27)28/h3-9,11-13,26H,10H2,1-2H3,(H,27,28)
NCI pathway
Reactome pathway
n/an/a 3.98n/an/an/an/an/an/a
Universidade de S£o Paulo
Curated by ChEMBL
Assay Description
Inhibition of thyroid hormone receptor beta
Bioorg Med Chem 15: 4609-17 (2007)
Article DOI: 10.1016/j.bmc.2007.04.015
BindingDB Entry DOI: 10.7270/Q2W37XJQ
3D
3D Structure (docked)
Thyroid hormone receptor alpha
(Homo sapiens (Human))
BDBM18924
(2-(3,5-dichloro-4-{4-hydroxy-3-[3-(propan-2-yl)phe...)
Show SMILES CC(C)c1cccc(c1)-c1cc(Oc2c(Cl)cc(CC(O)=O)cc2Cl)ccc1O
Show InChI InChI=1S/C23H20Cl2O4/c1-13(2)15-4-3-5-16(11-15)18-12-17(6-7-21(18)26)29-23-19(24)8-14(9-20(23)25)10-22(27)28/h3-9,11-13,26H,10H2,1-2H3,(H,27,28)
NCI pathway
Reactome pathway
n/an/a 123n/an/an/an/an/an/a
Universidade de S£o Paulo
Curated by ChEMBL
Assay Description
Inhibition of thyroid hormone receptor alpha
Bioorg Med Chem 15: 4609-17 (2007)
Article DOI: 10.1016/j.bmc.2007.04.015
BindingDB Entry DOI: 10.7270/Q2W37XJQ
Thyroid hormone receptor beta
(Homo sapiens (Human))
BDBM18924
(2-(3,5-dichloro-4-{4-hydroxy-3-[3-(propan-2-yl)phe...)
Show SMILES CC(C)c1cccc(c1)-c1cc(Oc2c(Cl)cc(CC(O)=O)cc2Cl)ccc1O
Show InChI InChI=1S/C23H20Cl2O4/c1-13(2)15-4-3-5-16(11-15)18-12-17(6-7-21(18)26)29-23-19(24)8-14(9-20(23)25)10-22(27)28/h3-9,11-13,26H,10H2,1-2H3,(H,27,28)
NCI pathway
Reactome pathway
n/an/a 3.98n/an/an/an/an/an/a
University of Insubria
Curated by ChEMBL
Assay Description
Inhibition of human thyroid hormone receptor beta 1
Bioorg Med Chem 15: 5251-61 (2007)
Article DOI: 10.1016/j.bmc.2007.05.016
BindingDB Entry DOI: 10.7270/Q2PK0HD8
3D
3D Structure (docked)