BDBM189428 US9174974, Example 13
SMILES: CC[C@@H](C(O)=O)c1ccc2NC(=O)OC[C@H](C)c3ccc(cc3C)[C@@H](Nc3ccc4c(N)ncc(F)c4c3)C(=O)N(C)Cc1c2
InChI Key: InChIKey=WLAIPSALBVRAPW-IAFMXWEJSA-N
Data: 2 KI
Activity Spreadsheet -- Enzyme Inhibition Constant Data from BindingDB
Found 2 hits for monomerid = 189428
Trg + Lig
Ki
nM
ΔG°
kcal/mole
IC50
nM
Kd
nM
EC50/IC50
nM
koff
s-1
kon
M-1s-1
pHTemp
°C
Coagulation factor VII
(Homo sapiens (Human))
BDBM189428
(US9174974, Example 13)
Show SMILES CC[C@@H](C(O)=O)c1ccc2NC(=O)OC[C@H](C)c3ccc(cc3C)[C@@H](Nc3ccc4c(N)ncc(F)c4c3)C(=O)N(C)Cc1c2 |r|
Show InChI InChI=1S/C34H36FN5O5/c1-5-24(33(42)43)26-10-7-22-13-21(26)16-40(4)32(41)30(38-23-8-11-27-28(14-23)29(35)15-37-31(27)36)20-6-9-25(18(2)12-20)19(3)17-45-34(44)39-22/h6-15,19,24,30,38H,5,16-17H2,1-4H3,(H2,36,37)(H,39,44)(H,42,43)/t19-,24+,30+/m0/s1
Reactome pathway
US Patent
0.610n/an/an/an/an/an/an/an/a
Bristol-Myers Squibb Company
US Patent
Assay Description
FVIIa-Xase Ki (37° C.): S2765 (0.5 mM), PCPS (25 μM), calcium chloride (5 mM), full-length human TF (3 nM), human FVIIa (5 pM), and FVIIa inhibi...
US Patent US9174974 (2015)
BindingDB Entry DOI: 10.7270/Q2W37V32
Coagulation factor VII
(Homo sapiens (Human))
BDBM189428
(US9174974, Example 13)
Show SMILES CC[C@@H](C(O)=O)c1ccc2NC(=O)OC[C@H](C)c3ccc(cc3C)[C@@H](Nc3ccc4c(N)ncc(F)c4c3)C(=O)N(C)Cc1c2 |r|
Show InChI InChI=1S/C34H36FN5O5/c1-5-24(33(42)43)26-10-7-22-13-21(26)16-40(4)32(41)30(38-23-8-11-27-28(14-23)29(35)15-37-31(27)36)20-6-9-25(18(2)12-20)19(3)17-45-34(44)39-22/h6-15,19,24,30,38H,5,16-17H2,1-4H3,(H2,36,37)(H,39,44)(H,42,43)/t19-,24+,30+/m0/s1
Reactome pathway
US Patent
380n/an/an/an/an/an/a7.4n/a
Bristol-Myers Squibb Company
US Patent
Assay Description
Tissue kallikrein-1 (37° C) activity was determined in reactions containing 0.05 nM enzyme and 90 μM substrate (H-D-Val-Leu-Arg-AFC) in buffer (...
US Patent US9174974 (2015)
BindingDB Entry DOI: 10.7270/Q2W37V32