null
SMILES: O=C(Nc1ccc(Oc2ccncc2)cc1)c1ccnc(c1)N1CCOCC1
InChI Key: InChIKey=DLOAYIHJIDPKJJ-UHFFFAOYSA-N
PDB links: 1 PDB ID matches this monomer.
Activity Spreadsheet -- Enzyme Inhibition Constant Data from BindingDB
Found 2 hits for monomerid = 192502
Trg + Lig
Ki
nM
ΔG°
kcal/mole
IC50
nM
Kd
nM
EC50/IC50
nM
koff
s-1
kon
M-1s-1
pHTemp
°C
Mitogen-activated protein kinase 13
(Homo sapiens (Human))
BDBM192502
(US9187470, 124)
Show SMILES O=C(Nc1ccc(Oc2ccncc2)cc1)c1ccnc(c1)N1CCOCC1
Show InChI InChI=1S/C21H20N4O3/c26-21(16-5-10-23-20(15-16)25-11-13-27-14-12-25)24-17-1-3-18(4-2-17)28-19-6-8-22-9-7-19/h1-10,15H,11-14H2,(H,24,26)
Reactome pathway
US Patent
n/an/a 1.49E+4n/an/an/an/an/a25
Washington University
US Patent
Assay Description
The MAPK13 blocking activity of test compounds was determined using an immobilized metal affinity polarization (IMAP) assay containing activated MAPK...
US Patent US9187470 (2015)
BindingDB Entry DOI: 10.7270/Q2N878M9
3D
3D Structure (crystal)
Mitogen-activated protein kinase 13
(Homo sapiens (Human))
BDBM192502
(US9187470, 124)
Show SMILES O=C(Nc1ccc(Oc2ccncc2)cc1)c1ccnc(c1)N1CCOCC1
Show InChI InChI=1S/C21H20N4O3/c26-21(16-5-10-23-20(15-16)25-11-13-27-14-12-25)24-17-1-3-18(4-2-17)28-19-6-8-22-9-7-19/h1-10,15H,11-14H2,(H,24,26)
Reactome pathway
US Patent
n/an/a 9.87E+4n/an/an/an/an/a25
Washington University
US Patent
Assay Description
The MAPK13 blocking activity of test compounds was determined using an immobilized metal affinity polarization (IMAP) assay containing activated MAPK...
US Patent US9187470 (2015)
BindingDB Entry DOI: 10.7270/Q2N878M9
3D
3D Structure (crystal)